program: Gaussian 09
title: 000258923
version: EM64L-G09RevD.01
frameworkgroup: C1[X(C14H15N2OPS)]
method: RPBEPBE
basis: SDD
operation: Freq
keyword: #p
keyword: freq=noraman
keyword: PBEPBE/SDD
title: #p freq=noraman PBEPBE/SDD
converged: YES YES NO NO
title: Mulliken charges:
elementType: S P O N N C C C C C C C C C C C C C C H H H H H H H H H H H H H H H
charge: -0.210083 0.560703 -0.269241 -0.551316 -0.803843 0.358089 0.390367 0.103450 -0.626115 -0.308891 -0.503766 -0.287802 -0.330856 0.351833 -0.383759 -0.223299 -0.213857 -0.223711 -0.537447 0.325524 0.239760 0.234441 0.244982 0.236394 0.241582 0.272219 0.283833 0.246960 0.235929 0.235520 0.234669 0.215242 0.244445 0.218044
chargesum: 0.00000
title: Mulliken charges with hydrogens summed into heavy atoms:
elementType: S P O N N C C C C C C C C C C C C C C
charge: -0.210083 0.560703 -0.269241 -0.551316 -0.478319 0.358089 0.390367 0.103450 0.093068 -0.072496 -0.262184 -0.015582 -0.047023 0.351833 -0.136799 0.012630 0.021663 0.010959 0.140284
polarizability: 3.02297871e+02 -1.66679782e+01 1.90976723e+02 -1.32194517e+01 1.15280899e+01 1.59238811e+02
1716.lowfreq: -9.3001 -1.9446 -0.0021 -0.0020 -0.0009 6.2497 20.8743 30.5791 50.4559
frequency: 18.7060 30.5058 50.4415 65.0818 94.3253 117.6758 121.5063 132.7432 158.5402 170.6002 209.1385 220.7349 228.7517 247.7136 261.0417 270.6777 315.8463 373.9768 395.2461 400.2161 422.7906 432.3060 443.8620 474.2460 498.6413 505.2211 576.3616 579.5576 607.0650 610.9623 683.3510 695.1362 698.1825 715.4851 734.6302 761.7231 778.0308 799.6973 828.1555 833.0209 859.0060 919.1275 927.0005 939.9158 986.2142 988.3522 997.5141 1007.3794 1018.6102 1068.6869 1077.2939 1081.7588 1110.8840 1115.5238 1125.3841 1152.2852 1167.3487 1174.3484 1187.9572 1193.5251 1244.1106 1266.4008 1297.0131 1309.7751 1333.7527 1383.1013 1396.3910 1427.5062 1430.1154 1443.8567 1462.8681 1464.2141 1464.5385 1468.8890 1473.1520 1488.7248 1503.3193 1587.5975 1592.1308 1598.8222 1627.8119 2949.0402 2961.9846 3033.0189 3041.5851 3086.8767 3119.9410 3126.3631 3132.4088 3142.9532 3152.0515 3154.4744 3160.0215 3167.8556 3177.1412 3605.6991
redmass: 3.8817 5.3496 4.2761 2.8991 4.6171 3.3334 3.4666 1.5981 3.9911 3.8501 3.7307 1.7846 3.3977 3.4417 5.4229 2.5137 7.5153 5.6962 2.8641 4.4318 2.0233 2.5547 3.2313 3.8006 7.4859 4.3006 5.8573 9.5081 3.6308 6.4081 7.9916 6.4588 2.0856 6.1565 2.8101 1.6903 3.9176 1.4941 1.8211 3.8678 1.2482 1.3558 4.3197 1.3732 5.7195 1.4065 4.1465 1.3259 3.1339 3.8129 2.0272 1.9582 1.2597 1.2940 1.3816 1.3794 2.0269 1.0562 1.1382 1.7291 1.6866 3.8338 1.3975 1.3147 4.3586 9.2519 5.7124 2.1160 1.2764 1.1765 1.6760 1.1922 1.0509 2.4434 1.1837 1.0579 3.1714 6.0603 5.8995 8.0152 7.1721 1.0335 1.0348 1.1036 1.1019 1.0986 1.0984 1.0872 1.0873 1.0915 1.0883 1.0962 1.0910 1.1015 1.0959 1.0786
irintensity: 0.1367 0.3064 1.3697 4.9650 1.6612 2.0183 0.9597 0.8353 3.4704 0.3626 3.6083 3.2313 16.7176 2.2542 0.6143 0.2958 4.1540 2.5767 1.9610 4.0058 29.4979 51.3107 57.6406 16.0800 35.0914 35.0966 5.8459 70.3278 14.2064 3.6788 52.3736 25.4024 42.7629 16.2769 3.3583 64.5501 3.9060 36.5560 55.1193 189.9652 0.6780 0.0799 30.1995 1.1082 0.8360 0.6654 66.2581 0.0977 1.6969 23.9154 38.9131 20.3067 0.2879 8.3997 38.2168 18.7087 209.8492 0.0622 8.5442 15.7649 117.8860 124.4830 8.0808 5.5858 150.1977 0.6765 21.7958 25.3623 14.8443 1.6548 2.2679 24.3785 13.2815 19.4077 96.1483 25.3258 357.4590 0.1809 0.1496 28.2586 41.8113 76.8965 62.5895 53.8053 30.2493 6.1017 30.8837 1.7466 1.0922 2.6395 10.5993 22.8184 6.9318 35.2487 6.0429 45.9438
temp: 298.150 k
press: 1.00000 atm
elementType: 16 15 8 7 7 6 6 6 6 6 6 6 6 6 6 6 6 6 6 1 1 1 1 1 1 1 1 1 1 1 1 1 1 1
symmnumber: 1
zpe: 687467.1 jmol-1
zpe.correction: 0.261842 hartree
zpe.thermalcorrener: 0.280425 hartree
zpe.thermalcorrenthalpy: 0.281369 hartree
zpe.thermalcorrgfe: 0.213574 hartree
zpe.sumelectzpe: -1465.132860 hartree
zpe.sumelectthermal: -1465.114278 hartree
zpe.sumelectthermalent: -1465.113334 hartree
zpe.sumelectthermalfe: -1465.181129 hartree
dipole: 0.7612 3.9677 0.1369
dipole: 4.0424
quadrupole: -118.0992 -129.4383 -118.1107
quadrupole: 4.8723 12.0296 -10.2045
quadrupole: 3.7835 -7.5556 3.7721 4.8723 12.0296 -10.2045
hfenergy: -1465.3947025 hartree
pointgroup: C01 [X(C14H15N2O1P1S1)]
dipole: -0.4390833 -1.460059 0.4525834 debye
polarizability: 298.3929177|-22.2857015|186.0088759|18.6463521|-19.9527927|168.1116106 unknown
InChI: InChI=1S/C14H15N2OPS/c1-16-14-9-8-11(17-2)10-13(14)15-18(16,19)12-6-4-3-5-7-12/h3-10,15H,1-2H3
charge 0 multiplicity 1
34 atoms
S  -1.733256 2.454704 -2.12748
P  -1.115178 0.947503 -0.820688
O  4.891551 -1.10725 0.08825
N  -0.133745 1.400107 0.595975
N  0.16129 -0.187318 -1.292895
C  1.161707 0.822919 0.572976
C  1.336223 -0.084457 -0.513906
C  -2.547699 -0.082872 -0.213333
C  -0.466237 2.546463 1.444119
C  2.230401 1.067198 1.459146
C  2.559311 -0.748828 -0.729403
C  -2.293642 -1.168285 0.659737
C  -3.862715 0.228909 -0.621952
C  3.622128 -0.500074 0.180788
C  3.459165 0.397207 1.262504
C  -3.374321 -1.948508 1.125319
C  -4.939407 -0.556364 -0.15085
C  -4.696523 -1.643144 0.721115
C  5.122492 -2.015492 -1.032709
H  0.141393 -0.670534 -2.189336
H  0.287716 3.351219 1.340452
H  -0.526909 2.245448 2.506942
H  -1.442565 2.960215 1.139157
H  2.116741 1.763769 2.295457
H  2.672254 -1.433302 -1.575243
H  -1.268002 -1.398198 0.968794
H  -4.022276 1.074763 -1.301526
H  4.304575 0.560068 1.936603
H  -3.187335 -2.790538 1.800516
H  -5.962338 -0.320794 -0.463733
H  -5.53268 -2.250795 1.084939
H  4.437866 -2.886726 -0.997998
H  6.160992 -2.359708 -0.917123
H  5.010025 -1.496609 -2.005713
