program: Gaussian 09
title: 000258928
version: EM64L-G09RevD.01
frameworkgroup: C1[X(C14H15N2PS)]
method: RPBEPBE
basis: SDD
operation: Freq
keyword: #p
keyword: freq=noraman
keyword: PBEPBE/SDD
title: #p freq=noraman PBEPBE/SDD
converged: YES YES NO NO
title: Mulliken charges:
elementType: S P N N C C C C C C C C C C C C C C H H H H H H H H H H H H H H H
charge: -0.206323 0.542334 -0.547443 -0.559241 0.368540 0.370481 0.108678 -0.624704 -0.623948 -0.339986 -0.341636 -0.288704 -0.331002 -0.241325 -0.241577 -0.223941 -0.213446 -0.223852 0.240875 0.235236 0.245011 0.241909 0.244515 0.234763 0.234371 0.234481 0.272985 0.283843 0.221287 0.221246 0.236221 0.235545 0.234807
chargesum: 0.00000
title: Mulliken charges with hydrogens summed into heavy atoms:
elementType: S P N N C C C C C C C C C C C C C C
charge: -0.206323 0.542334 -0.547443 -0.559241 0.368540 0.370481 0.108678 0.096419 0.097239 -0.105615 -0.107155 -0.015720 -0.047159 -0.020038 -0.020331 0.012280 0.022099 0.010955
polarizability: 2.72991645e+02 -2.58352683e+01 1.95381862e+02 -8.40108975e-01 6.39947179e-01 1.54606934e+02
1716.lowfreq: -7.1133 -3.4027 -0.0011 0.0011 0.0013 11.3024 25.2309 33.8539 46.5220
frequency: 25.0200 33.8067 46.4363 88.0049 91.7045 112.4228 124.0475 129.7068 142.5607 199.9493 200.5359 233.9602 238.9495 270.6470 280.3899 305.4570 340.4488 397.5360 438.1184 442.4684 469.5697 489.9887 499.1296 538.5219 561.5012 576.1481 610.4007 678.5239 684.9112 691.4611 699.5653 737.6233 741.1372 764.6584 827.9004 836.4391 841.7615 861.3565 902.6569 941.6806 954.7546 986.1556 989.7980 1007.9177 1018.0465 1025.3328 1041.7547 1074.9909 1081.5079 1114.0892 1115.2678 1116.3134 1122.1749 1168.7146 1174.2640 1187.0249 1192.8624 1201.2512 1287.6688 1300.8727 1308.6449 1322.6298 1382.6286 1412.8679 1426.5623 1437.0961 1442.7281 1454.7482 1462.7162 1464.3052 1465.3494 1486.7199 1490.0054 1502.0368 1587.0514 1591.8333 1597.6807 1605.8491 2963.8082 2964.2822 3043.2235 3043.9436 3088.2257 3090.1754 3125.8490 3131.3054 3132.0718 3142.1110 3144.4394 3153.8862 3156.7508 3167.5651 3169.7322
redmass: 3.6848 4.6785 4.0352 2.2835 2.8743 1.6411 1.8246 3.4393 1.9246 6.5033 4.3638 3.8282 3.2175 4.9435 4.1003 5.8521 6.2813 2.8422 4.5717 3.4723 6.1970 7.7153 4.5007 5.9362 3.9275 11.0145 6.4956 7.7992 4.9466 6.9784 2.0623 1.2300 3.8440 1.5751 4.4037 1.4596 3.6245 1.2450 1.3816 1.3657 1.2929 5.7839 1.4024 1.3251 3.1078 2.1391 4.8077 2.0976 1.9064 1.7458 1.6984 1.3888 1.4433 1.0641 1.0578 1.1356 1.6342 2.1683 2.5104 2.4459 1.3226 3.7748 9.0563 4.5628 2.1079 1.4630 1.2025 1.6647 1.7859 1.0487 1.1265 1.0750 1.0757 3.7165 6.0266 5.8998 7.1492 7.1063 1.0348 1.0348 1.1020 1.1022 1.0988 1.0986 1.0873 1.0846 1.0872 1.0915 1.0894 1.0961 1.0943 1.1015 1.1002
irintensity: 0.0224 0.3401 0.6222 2.4002 3.6244 0.7153 0.4801 1.8108 0.0982 15.3729 1.9734 0.9570 0.0198 1.2385 0.0410 0.6997 6.5235 0.0419 0.6312 11.5880 25.2140 42.0591 32.5253 0.9705 0.0730 60.6919 1.0198 56.2091 1.1071 22.4690 42.0424 117.1136 1.4160 51.1548 2.7131 0.1951 195.7679 0.4724 5.0577 1.2043 0.0089 1.0341 0.3999 0.1482 2.1390 29.4597 26.7662 41.4684 18.2079 18.7090 21.4613 2.9376 25.7342 0.8379 0.1199 15.1032 19.3043 58.6477 37.7867 32.5301 6.5006 167.2030 0.6354 20.6742 21.4468 0.6596 3.2689 15.7531 1.7851 0.7560 34.1960 21.4188 17.8972 303.8039 0.1488 0.0844 1.3728 26.6775 116.5393 6.4966 24.1129 33.0850 5.0043 7.1624 1.6909 0.0440 0.8587 2.1877 14.8707 22.7535 29.4357 36.2727 19.2484
temp: 298.150 k
press: 1.00000 atm
elementType: 16 15 7 7 6 6 6 6 6 6 6 6 6 6 6 6 6 6 1 1 1 1 1 1 1 1 1 1 1 1 1 1 1
symmnumber: 1
zpe: 677186.2 jmol-1
zpe.correction: 0.257927 hartree
zpe.thermalcorrener: 0.275438 hartree
zpe.thermalcorrenthalpy: 0.276382 hartree
zpe.thermalcorrgfe: 0.211166 hartree
zpe.sumelectzpe: -1390.002092 hartree
zpe.sumelectthermal: -1389.984581 hartree
zpe.sumelectthermalent: -1389.983637 hartree
zpe.sumelectthermalfe: -1390.048853 hartree
dipole: -1.3524 -3.6279 -0.2744
dipole: 3.8815
quadrupole: -111.0277 -129.4061 -110.1372
quadrupole: 4.0614 0.6604 -2.3276
quadrupole: 5.8293 -12.5491 6.7198 4.0614 0.6604 -2.3276
hfenergy: -1390.2600189 hartree
pointgroup: C01 [X(C14H15N2P1S1)]
dipole: 0.6353754 -0.5833627 -1.2601733 debye
polarizability: 268.8113869|13.6259626|161.1519251|28.125585|15.818021|193.0171292 unknown
InChI: InChI=1S/C14H15N2PS/c1-15-13-10-6-7-11-14(13)16(2)17(15,18)12-8-4-3-5-9-12/h3-11H,1-2H3
charge 0 multiplicity 1
33 atoms
S  0.857158 1.395555 2.890632
P  0.437281 0.517775 1.043612
N  -0.623688 -0.909892 0.991382
N  -0.64062 1.338863 -0.109294
C  -1.802007 -0.688613 0.243798
C  -1.815035 0.600645 -0.381444
C  1.995019 0.097199 0.104089
C  -0.462218 -2.046597 1.90027
C  -0.497002 2.754541 -0.45572
C  -2.892958 -1.565981 0.094205
C  -2.920257 1.01127 -1.150769
C  1.882811 -0.429677 -1.205633
C  3.258907 0.300818 0.699685
C  -3.998381 -1.153528 -0.69546
C  -4.012302 0.117729 -1.30907
C  3.054442 -0.754872 -1.9231
C  4.427314 -0.028234 -0.024617
C  4.32607 -0.555384 -1.333187
H  -1.33102 -2.137636 2.580688
H  -0.348375 -2.990873 1.335236
H  0.437257 -1.897017 2.521299
H  -1.348137 3.349103 -0.07047
H  0.42658 3.154279 -0.004187
H  -0.436091 2.885379 -1.552534
H  -2.889105 -2.550031 0.573531
H  -2.937197 1.999086 -1.6221
H  0.895141 -0.578735 -1.656277
H  3.309313 0.715918 1.713559
H  -4.84833 -1.832064 -0.824931
H  -4.87305 0.423816 -1.913241
H  2.977429 -1.161316 -2.937379
H  5.411568 0.127103 0.430309
H  5.233285 -0.808924 -1.893081
