program: Gaussian 09
title: 000258918
version: EM64L-G09RevD.01
frameworkgroup: C1[X(C12H10ClN2PS)]
method: RPBEPBE
basis: SDD
operation: Freq
keyword: #p
keyword: freq=noraman
keyword: PBEPBE/SDD
title: #p freq=noraman PBEPBE/SDD
converged: YES YES NO NO
title: Mulliken charges:
elementType: Cl S P N N C C C C C C C C C C C C H H H H H H H H H H
charge: -0.074988 -0.193456 0.575186 -0.797048 -0.793666 0.406531 0.371335 0.096115 -0.354814 -0.343920 -0.285865 -0.329170 -0.072157 -0.222472 -0.221514 -0.212106 -0.221525 0.333240 0.330220 0.257105 0.233738 0.270613 0.283570 0.252257 0.238304 0.237578 0.236909
chargesum: 0.00000
title: Mulliken charges with hydrogens summed into heavy atoms:
elementType: Cl S P N N C C C C C C C C C C C C
charge: -0.074988 -0.193456 0.575186 -0.463808 -0.463446 0.406531 0.371335 0.096115 -0.097709 -0.110182 -0.015252 -0.045599 -0.072157 0.029785 0.016789 0.025472 0.015384
polarizability: 2.90428645e+02 2.09593942e+01 1.78269527e+02 -6.89902941e+00 -4.60092441e+00 1.26141132e+02
1716.lowfreq: -6.6298 -0.0028 -0.0016 -0.0012 6.2152 8.3370 18.7217 31.3625 62.3144
frequency: 18.0778 31.3476 62.2953 100.7235 119.0590 140.7043 175.9083 202.4277 237.8056 238.6672 261.0602 312.1851 344.5066 368.1667 395.8988 399.2354 424.2779 454.1556 463.2986 490.7973 509.6215 569.7307 580.7275 608.6255 646.2213 652.8706 692.3876 697.8432 730.0736 759.7178 768.5813 779.4866 793.6133 825.1020 847.0781 858.9412 889.2452 912.0325 940.8428 986.2829 988.4485 1007.7786 1018.6722 1061.9750 1078.0210 1081.8232 1119.1774 1175.3007 1188.4717 1212.2303 1223.2070 1252.4643 1298.8124 1309.9449 1316.4104 1383.4109 1417.2427 1427.8627 1439.7294 1463.4159 1492.0611 1587.4875 1592.0021 1598.7288 1612.7666 3127.8618 3133.8771 3143.7763 3148.8723 3155.7940 3169.0233 3169.2349 3178.9268 3606.7054 3607.8037
redmass: 3.8599 8.9571 4.9380 10.1758 7.7918 8.2721 6.8273 4.8187 6.5752 5.1987 6.7149 8.7765 4.6107 9.4512 2.9345 4.7093 2.8752 1.4928 1.4522 2.7186 7.1224 4.4631 9.1151 6.5263 10.0166 7.5755 7.2891 2.0398 3.3646 1.9944 3.7355 4.3047 1.4870 3.9913 1.5046 1.2468 6.1870 1.3506 1.3695 6.1896 1.3841 1.3291 3.1118 2.0183 2.1836 1.8404 1.4893 1.0559 1.1279 1.8814 1.8158 1.4269 1.4510 1.3282 2.7773 9.2401 3.4005 2.1231 3.3306 2.0313 4.6654 6.0234 5.9115 7.1516 7.7647 1.0874 1.0874 1.0915 1.0897 1.0962 1.1015 1.0931 1.0959 1.0779 1.0795
irintensity: 0.0242 0.5021 0.1207 0.8850 1.4558 2.8038 0.8221 5.0454 1.6909 1.2389 0.5962 2.7177 6.8111 16.0897 1.7478 8.3567 23.8921 7.8710 123.6486 27.9638 132.4596 5.8870 62.2121 1.3909 20.4364 87.0507 30.9669 42.4484 0.5971 65.1482 37.0373 20.5727 60.2080 153.2086 33.7791 0.5631 86.9465 0.5288 1.4712 1.0324 0.5370 0.0745 1.3042 22.6316 48.7221 13.7094 12.9718 0.0249 12.3180 1.1224 17.9028 8.7418 123.5813 18.8051 324.1012 0.6822 1.1974 24.8169 13.2474 11.7842 376.6532 0.2629 0.0124 6.8028 18.4632 1.7790 0.7462 2.1820 7.9886 21.8849 31.3332 2.2741 2.4902 101.0583 10.3615
temp: 298.150 k
press: 1.00000 atm
elementType: 17 16 15 7 7 6 6 6 6 6 6 6 6 6 6 6 6 1 1 1 1 1 1 1 1 1 1
symmnumber: 1
zpe: 508885.1 jmol-1
zpe.correction: 0.193824 hartree
zpe.thermalcorrener: 0.209175 hartree
zpe.thermalcorrenthalpy: 0.210119 hartree
zpe.thermalcorrgfe: 0.149183 hartree
zpe.sumelectzpe: -1770.955552 hartree
zpe.sumelectthermal: -1770.940201 hartree
zpe.sumelectthermalent: -1770.939257 hartree
zpe.sumelectthermalfe: -1771.000194 hartree
dipole: 3.1573 -3.3370 1.1358
dipole: 4.7322
quadrupole: -123.3934 -128.4881 -109.9453
quadrupole: -11.3401 -3.4596 1.7007
quadrupole: -2.7845 -7.8792 10.6636 -11.3401 -3.4596 1.7007
hfenergy: -1771.1493761 hartree
pointgroup: C01 [X(C12H10Cl1N2P1S1)]
dipole: -1.4547053 0.8211309 0.8221331 debye
polarizability: 280.0883065|27.5457253|170.1612427|28.3564557|28.4632526|144.5897546 unknown
InChI: InChI=1S/C12H10ClN2PS/c13-9-6-7-11-12(8-9)15-16(17,14-11)10-4-2-1-3-5-10/h1-8,14-15H
charge 0 multiplicity 1
27 atoms
Cl 5.428139 1.631638 0.078307
S  -1.136759 -2.770871 -1.912201
P  -0.712956 -1.096575 -0.749923
N  0.544136 0.038366 -1.289766
N  0.21158 -1.292263 0.752765
C  1.671689 0.103086 -0.445982
C  1.480632 -0.672304 0.742838
C  -2.22997 -0.092573 -0.346437
C  2.872732 0.803876 -0.664357
C  2.493067 -0.748164 1.715786
C  -2.094118 1.087908 0.423642
C  -3.494176 -0.518679 -0.809461
C  3.8662 0.717884 0.336637
C  3.704083 -0.036167 1.511994
C  -3.243408 1.848341 0.730194
C  -4.639531 0.248376 -0.497722
C  -4.515233 1.429579 0.270162
H  0.550535 0.413942 -2.236612
H  -0.042337 -1.995012 1.445012
H  3.036715 1.394943 -1.569374
H  2.357358 -1.344826 2.623504
H  -1.107691 1.407172 0.777549
H  -3.563934 -1.437973 -1.403208
H  4.501638 -0.076603 2.258243
H  -3.148134 2.763007 1.325027
H  -5.623665 -0.075101 -0.853126
H  -5.404792 2.022595 0.51001
