program: Gaussian 09
title: 000258898
version: EM64L-G09RevD.01
frameworkgroup: C1[X(C5HF7N2O2)]
method: RPBEPBE
basis: SDD
operation: Freq
keyword: #p
keyword: freq=noraman
keyword: PBEPBE/SDD
title: #p freq=noraman PBEPBE/SDD
converged: YES YES NO NO
title: Mulliken charges:
elementType: F F F F F F F O O N N C C C C C H
charge: -0.110651 -0.125506 -0.161850 -0.120063 -0.124434 -0.112965 -0.141847 -0.181687 -0.110842 -0.280738 -0.068805 0.234913 0.229832 0.231641 0.375956 0.085235 0.381811
chargesum: 0.00000
title: Mulliken charges with hydrogens summed into heavy atoms:
elementType: F F F F F F F O O N N C C C C C
charge: -0.110651 -0.125506 -0.161850 -0.120063 -0.124434 -0.112965 -0.141847 -0.181687 -0.110842 0.101073 -0.068805 0.234913 0.229832 0.231641 0.375956 0.085235
polarizability: 9.49019322e+01 -1.65779134e+01 6.11484064e+01 -4.75432782e+00 8.07944311e+00 7.70684562e+01
1716.lowfreq: -4.4261 -0.0013 -0.0010 -0.0006 3.0410 5.6201 17.2126 35.6685 52.2881
frequency: 17.1135 35.6379 52.2662 82.8648 130.5077 151.0577 202.2253 208.8211 238.6901 256.1843 282.2360 284.5450 298.3253 324.0816 329.3077 349.9941 386.7415 428.9993 460.8133 480.0351 512.3688 527.5169 565.4372 582.8542 631.7090 652.8411 672.1241 701.5941 843.1029 928.6656 936.8467 981.6643 1016.1908 1034.7032 1059.5686 1063.2586 1087.6418 1113.1126 1151.9166 1200.7668 1269.3210 1451.8918 1502.7642 1828.2326 3587.3734
redmass: 17.6665 10.5576 13.7462 17.4181 16.1432 15.0568 18.4067 13.6080 16.9810 15.8152 17.6936 12.8211 17.9226 13.1298 17.5896 13.1444 15.2213 11.1757 11.8619 1.3698 12.8860 9.8774 11.3801 16.4656 13.1525 16.7540 12.5848 7.0970 12.8616 10.7469 13.5819 11.9254 13.0929 12.2495 12.5151 5.9210 12.8017 8.4509 6.9281 12.3800 1.6568 6.4343 9.0767 12.8992 1.0843
irintensity: 0.2144 4.8156 0.5592 0.7042 4.3687 0.5417 5.2273 2.1550 4.3040 1.6175 1.1454 5.3384 0.2270 15.0586 1.0854 26.2992 4.3782 30.2220 15.6033 126.2129 2.4169 9.8462 15.3044 10.8343 3.1402 29.3257 2.7225 0.2367 141.3059 63.8780 42.3733 97.8914 100.1417 21.5512 295.4675 77.2276 179.5938 81.5669 17.4290 53.3155 64.5952 46.4953 69.3493 553.3307 172.4943
temp: 298.150 k
press: 1.00000 atm
elementType: 9 9 9 9 9 9 9 8 8 7 7 6 6 6 6 6 1
symmnumber: 1
zpe: 190827.8 jmol-1
zpe.correction: 0.072682 hartree
zpe.thermalcorrener: 0.087549 hartree
zpe.thermalcorrenthalpy: 0.088493 hartree
zpe.thermalcorrgfe: 0.028934 hartree
zpe.sumelectzpe: -1148.692668 hartree
zpe.sumelectthermal: -1148.677801 hartree
zpe.sumelectthermalent: -1148.676857 hartree
zpe.sumelectthermalfe: -1148.736416 hartree
dipole: -1.6387 1.4859 3.7329
dipole: 4.3391
quadrupole: -104.3345 -90.5092 -86.9821
quadrupole: 7.5802 6.8141 1.2878
quadrupole: -10.3926 3.4327 6.9598 7.5802 6.8141 1.2878
hfenergy: -1148.7653501 hartree
pointgroup: C01 [X(C5H1F7N2O2)]
dipole: 0.6322437 0.4346629 -1.5250104 debye
dipolederiv: -0.3215898 -0.0091509 0.0177626 0.0168134 -0.2711255 0.0519413 0.1197222 0.0999679 -0.5730577 -0.6945952 -0.2080682 0.0317084 -0.1815373 -0.3951702 0.0220208 -0.0541178 -0.0282781 -0.2417163 -0.4024711 -0.0057426 0.061032 -0.0466062 -0.3017141 0.0952599 0.1179982 0.0221082 -0.6077213 -0.3850552 0.002396 -0.0051833 -0.0819718 -0.634518 -0.2155495 -0.0606968 -0.1503924 -0.3258876 -0.3867448 -0.0344806 0.1958767 0.0260782 -0.3209841 0.00605 0.2215226 0.0853535 -0.6350635 -0.5113573 0.1846391 -0.1833443 0.2918996 -0.4741035 0.1673391 -0.1724961 0.0949605 -0.4102803 -0.7624248 -0.1067655 -0.0396632 -0.183821 -0.4370773 -0.0522514 -0.0872229 -0.074181 -0.2697616 -0.3274559 -0.0235239 -0.2884555 -0.1093106 -0.1429372 -0.0566976 0.1453605 0.1327777 -0.6057354 -0.9787336 -0.3259572 0.4311543 -0.3419631 -0.4166786 0.2172786 0.3408755 0.167088 -0.5417946 0.0458083 0.1003447 0.1135271 0.0736753 -0.1966429 0.1356165 0.2865703 0.1884293 -0.6918851 -0.9441285 -0.3133135 0.4179058 -0.2698746 -0.3445695 0.2060803 0.0093157 0.0390968 -0.5103109 1.0130725 0.2603076 -0.0714468 0.0681757 0.6271575 -0.0825091 -0.019963 -0.0601759 0.8147479 1.0283216 0.0233236 -0.0762677 0.215282 1.0364414 0.1662259 -0.04584 0.0905161 0.959368 0.0949987 -0.056407 -0.0638904 0.1110045 0.0978337 -0.1374019 -0.2324988 -0.2052672 0.8433176 1.6428842 -0.0057892 0.0513817 -0.1363301 1.2358217 -0.1540411 -0.020616 -0.073752 1.3096449 1.6423725 0.5859983 -0.5949549 0.6217985 0.567489 -0.3587163 -0.545882 -0.3173028 1.0991837 0.2470986 -0.0678106 0.0028574 -0.0733126 0.3707774 -0.0106455 -0.0020317 -0.0109486 0.3869521 unknown
polarizability: 95.6543874|14.8543154|58.8935508|-6.6785979|-6.6470822|78.5708566 unknown
InChI: InChI=1S/C5HF7N2O2/c6-3(7,1-13-2(15)16-14-1)4(8,9)5(10,11)12/h14H
charge 0 multiplicity 1
17 atoms
F  1.199743 -0.028519 1.824386
F  2.687904 1.048039 0.467109
F  0.71333 1.383793 -1.508257
F  0.316607 2.343833 0.535221
F  2.462132 -0.857409 -1.484601
F  2.692939 -1.87377 0.526558
F  0.66078 -1.81605 -0.489837
O  -2.985807 -0.197348 -1.075889
O  -3.919837 -0.879528 1.087771
N  -1.719804 0.367618 -1.319879
N  -1.68865 0.064251 0.929541
C  1.515815 0.259011 0.484208
C  0.348592 1.10449 -0.146594
C  -1.029596 0.487591 -0.156536
C  1.845925 -1.090219 -0.250674
C  -2.937627 -0.399616 0.545521
H  -1.481247 0.594331 -2.286048
