program: Gaussian 09
title: 000258893
version: EM64L-G09RevD.01
frameworkgroup: C1[X(C12H9N3)]
method: RPBEPBE
basis: SDD
operation: Freq
keyword: #pfreq=noraman
keyword: PBEPBE/SDD
title: #p freq=noraman PBEPBE/SDD
converged: YES YES NO NO
title: Mulliken charges:
elementType: N N N C C C C C C C C C C C C H H H H H H H H H
charge: -0.408394 -0.011982 -0.013119 -0.543693 -0.414440 0.299197 0.206896 0.278233 -0.312134 -0.419413 0.138336 -0.297919 -0.202516 -0.274023 -0.260665 0.253402 0.259520 0.237128 0.235584 0.306080 0.249302 0.221559 0.239730 0.233331
chargesum: 0.00000
title: Mulliken charges with hydrogens summed into heavy atoms:
elementType: N N N C C C C C C C C C C C C
charge: -0.102314 -0.011982 -0.013119 -0.030771 0.058272 0.299197 0.206896 0.278233 -0.062832 -0.197853 0.138336 -0.058189 0.030815 -0.274023 -0.260665
polarizability: 2.41967110e+02 1.48763501e+00 1.74075258e+02 2.25072005e-01 2.04545997e-01 6.91345913e+01
1716.lowfreq: -11.9116 -1.7517 -0.0009 -0.0009 -0.0006 6.6912 40.7927 63.8840 119.8566
frequency: 40.7872 63.8722 119.8529 141.5921 156.0173 162.2585 234.5710 244.1222 275.5814 357.1203 404.1304 410.7914 432.6406 452.9657 469.9560 498.8956 512.1045 547.5200 564.6170 604.1661 629.1186 649.1170 698.4556 745.6806 763.1517 786.7820 845.8551 851.1197 935.5759 946.7181 952.1163 981.6884 1039.1148 1058.0885 1062.6900 1124.1825 1136.2850 1178.6049 1182.7150 1203.2359 1230.2264 1263.4367 1290.8591 1322.8034 1334.2259 1363.6507 1402.4790 1429.6959 1455.9504 1470.4529 1486.5881 1517.5370 1537.4424 1567.7399 1623.9587 2151.1133 2164.5864 2942.0036 2986.2961 3057.9296 3085.0732 3121.6233 3146.4886 3166.5611 3193.0942 3564.0891
redmass: 6.0517 5.5520 5.9202 9.8569 3.6194 4.5752 5.7308 6.2992 2.8429 5.0180 4.3835 3.6754 3.9308 3.2200 1.7939 4.3265 3.8556 5.0914 4.7208 11.5585 3.5806 5.6791 4.0490 2.9411 1.4828 5.8119 2.6813 1.5801 2.9243 3.0238 1.4018 1.3375 2.5032 3.2773 2.1484 2.5313 1.7923 1.6258 2.1655 1.1977 1.2829 1.8251 2.1509 1.7109 1.5393 1.5722 5.2389 1.8707 1.0899 1.2681 2.0167 2.3657 8.4754 5.1364 5.9791 12.6305 12.6303 1.0700 1.0658 1.0937 1.0950 1.0876 1.0916 1.0948 1.0950 1.0774
irintensity: 0.7279 1.6518 1.1844 5.3432 1.6511 2.2870 11.5904 0.3544 1.2000 1.9678 4.5052 3.2799 26.8542 35.1751 49.8963 1.7948 5.4938 4.2454 1.7056 0.7823 1.6038 3.6963 4.1310 21.3665 82.5360 1.8403 2.8704 5.0250 0.6016 4.2092 0.9954 0.5000 3.0156 2.2990 2.4610 5.6912 8.7279 34.0076 2.8867 19.5145 7.6026 6.4048 54.6847 86.9178 5.0972 54.6019 23.3095 25.6748 18.2372 29.9527 7.1817 152.6640 241.4190 58.5358 121.7640 27.3437 83.9532 62.0103 11.4097 30.5873 7.6571 11.1916 17.0236 15.3824 7.1245 50.2271
temp: 298.150 k
press: 1.00000 atm
elementType: 7 7 7 6 6 6 6 6 6 6 6 6 6 6 6 1 1 1 1 1 1 1 1 1
symmnumber: 1
zpe: 474557.2 jmol-1
zpe.correction: 0.180749 hartree
zpe.thermalcorrener: 0.193292 hartree
zpe.thermalcorrenthalpy: 0.194236 hartree
zpe.thermalcorrgfe: 0.141522 hartree
zpe.sumelectzpe: -625.869046 hartree
zpe.sumelectthermal: -625.856503 hartree
zpe.sumelectthermalent: -625.855559 hartree
zpe.sumelectthermalfe: -625.908273 hartree
dipole: -7.2784 -4.9983 -0.0763
dipole: 8.8298
quadrupole: -100.1234 -83.0241 -89.3177
quadrupole: -0.4877 -1.2773 -5.3918
quadrupole: -9.3017 7.7976 1.5040 -0.4877 -1.2773 -5.3918
hfenergy: -626.0497952 hartree
pointgroup: C01 [X(C12H9N3)]
dipole: 2.7576526 2.1124517 0.0289835 debye
dipolederiv: -0.194944 0.3387215 0.0998638 -0.1032352 -1.3396608 -0.1221749 0.0381781 0.0968423 -0.4314914 -0.5807453 0.0072627 -0.0192702 0.1728421 -0.2207296 0.0042495 -0.0219593 -0.0047152 -0.238754 -0.243123 -0.0153931 0.0086626 -0.2223819 -0.3960465 0.0246134 0.062543 0.0340927 -0.2477148 -0.0108854 0.0002001 -0.0132463 0.0771837 -0.0563823 0.0095676 0.0640705 0.0292626 0.045646 0.2617841 -0.3843058 -0.1878561 -0.1025585 0.2380599 -0.0165029 -0.152365 -0.0424325 0.3310387 1.5946043 0.38317 -0.0251259 0.1058199 0.2157859 -0.0848214 0.0016736 -0.0745422 0.0486232 -0.9888565 -0.3261071 -0.0535281 0.5807464 -0.2182566 -0.006753 0.0002565 -0.0055647 -0.1002501 0.1507066 -0.3882458 -0.0494744 0.2625943 1.3644436 0.1830088 -0.0681521 0.1293869 0.1384069 0.392977 0.0741546 0.029291 -0.6351025 0.0120823 0.02148 0.0392197 0.0233085 -0.0726082 0.1061925 0.5624405 0.0857319 0.0151199 -0.3624346 -0.028847 0.000605 -0.0278487 -0.2244455 -0.7679312 -0.1697676 0.0161729 -0.4830266 -0.1500458 0.0120037 -0.0156827 0.0045492 0.0827615 -0.7833735 -0.220613 -0.0294291 -0.1395393 -0.0416803 0.0290888 -0.0481931 0.0124545 -0.2017953 0.2706251 0.0277588 0.0158739 0.435591 0.3976428 0.0706011 0.0789116 0.0822145 -0.0886587 0.6653271 -0.0841374 0.0441849 -0.3166998 -0.0668495 0.0101921 0.0316724 0.0089022 0.0266604 -0.0691587 0.0073569 -0.0252823 0.3662015 0.4009062 -0.0658323 -0.0742176 -0.0524546 0.0715187 0.077646 -0.0460667 0.0544997 -0.043566 -0.0000413 0.0252695 -0.0031309 0.0028514 -0.0765864 -0.0426895 0.082365 0.0196666 0.0335924 0.079608 -0.0042462 0.0270348 -0.0289139 0.0924255 0.0492852 -0.0016789 0.010992 0.0079228 -0.1716749 0.0178265 0.0026705 0.051178 0.087835 0.0220903 0.1528376 0.0682015 -0.0235612 0.0866526 0.0496891 0.0954776 -0.0581221 -0.1619836 0.1018407 0.0485178 -0.0131717 0.0462596 0.222862 -0.033067 -0.0025187 -0.0785605 0.306566 0.0620927 -0.0644728 -0.0302385 -0.0279711 0.0399328 -0.0143517 -0.0283637 -0.0108856 0.1363979 -0.0140275 -0.0688653 -0.0129034 -0.1382797 -0.0476572 -0.0345161 -0.0275709 -0.0455242 0.1595189 0.0533248 0.0307997 0.0036865 0.0707247 -0.0763947 -0.0382008 -0.0115614 -0.0419931 0.1661734 -0.1127618 0.0540683 0.0026989 0.0613233 0.0898779 -0.0082765 0.0114025 -0.0034852 0.1507161 unknown
polarizability: 241.6296256|4.9930315|174.3601051|0.3826885|2.3592433|69.1872284 unknown
InChI: InChI=1S/C12H9N3/c13-7-9(8-14)10-5-6-15-12-4-2-1-3-11(10)12/h1-4,15H,5-6H2
charge 0 multiplicity 1
24 atoms
N  1.467985 2.24133 0.276174
N  -4.229068 0.635261 -0.286337
N  -1.938473 -3.002159 0.466585
C  -0.859831 1.871663 -0.391819
C  0.087836 2.688442 0.502585
C  -0.674426 0.375168 -0.152208
C  0.715914 -0.081598 -0.09956
C  1.766747 0.903475 0.066858
C  1.110373 -1.445958 -0.280044
C  3.133101 0.493176 0.037012
C  -1.823642 -0.420441 -0.043057
C  2.455122 -1.835656 -0.29934
C  3.472154 -0.85433 -0.139278
C  -3.133806 0.162121 -0.176868
C  -1.850369 -1.831344 0.2291
H  -0.629116 2.091268 -1.453969
H  -1.900097 2.184669 -0.208599
H  0.007603 3.760382 0.251181
H  -0.199067 2.565558 1.569946
H  2.233478 2.874958 0.50603
H  0.345635 -2.209706 -0.434449
H  3.919056 1.248079 0.161694
H  2.718331 -2.887049 -0.446571
H  4.527155 -1.14951 -0.154668
