program: Gaussian 09
title: 000258956
version: EM64L-G09RevD.01
frameworkgroup: C1[X(C18H19NO4)]
method: RPBEPBE
basis: SDD
operation: Freq
keyword: #p
keyword: freq=noraman
keyword: PBEPBE/SDD
title: #p freq=noraman PBEPBE/SDD
converged: YES YES NO NO
title: Mulliken charges:
elementType: O O O O N C C C C C C C C C C C C C C C C C C H H H H H H H H H H H H H H H H H H H
charge: -0.281404 -0.262480 -0.266526 -0.264117 -0.118597 -0.216787 -0.254583 0.375349 -0.104558 -0.381309 -0.567742 0.335782 -0.531353 -0.453116 0.263594 -0.418410 -0.522559 -0.516041 0.158245 0.156593 0.317916 -0.205631 -0.758983 0.257444 0.264120 0.271926 0.182084 0.231164 0.221995 0.239178 0.239373 0.192768 0.217348 0.232873 0.220255 0.277642 0.254542 0.239257 0.229830 0.254074 0.245907 0.244937
chargesum: 0.00000
title: Mulliken charges with hydrogens summed into heavy atoms:
elementType: O O O O N C C C C C C C C C C C C C C C C C C
charge: -0.281404 -0.262480 -0.266526 -0.264117 -0.118597 0.040657 0.009537 0.375349 0.167368 0.031939 -0.106569 0.335782 -0.099212 -0.002895 0.263594 -0.198155 -0.244917 -0.261498 0.158245 0.156593 0.317916 0.263456 -0.014064
polarizability: 2.62618088e+02 1.14389521e+01 2.08236157e+02 5.00066460e+00 -2.23118298e+01 1.45246346e+02
1716.lowfreq: -4.0250 -0.0005 -0.0001 0.0004 1.6642 8.5075 31.7428 39.0468 50.9738
frequency: 31.6915 38.9578 50.9612 61.3160 62.6751 86.2310 94.1463 128.5067 148.9550 172.8239 189.7681 202.1316 211.1484 233.8146 257.9950 274.9656 302.8708 335.1844 347.7585 366.7550 399.1625 424.8884 449.1804 460.2116 509.5027 512.9855 556.6497 567.9746 585.3549 593.7065 617.9058 643.6483 673.5991 682.1443 707.1636 720.6161 735.2259 763.0334 772.7092 811.9137 824.8967 837.5924 855.9603 861.6234 871.9993 887.6494 898.9200 914.8430 939.6706 969.7794 972.8485 974.8583 991.1540 997.0925 1011.6652 1023.3243 1039.9381 1042.4994 1071.3230 1083.8731 1110.5270 1125.8577 1131.2875 1149.9065 1155.7604 1164.1675 1172.3221 1182.7151 1194.6380 1208.2310 1217.1234 1221.3224 1242.2277 1249.9811 1256.7496 1267.0626 1276.4099 1286.7364 1306.9828 1315.4802 1329.1852 1342.0949 1349.6639 1360.7082 1365.0672 1379.3083 1383.5001 1398.7695 1422.6718 1444.6755 1453.3874 1453.6723 1455.3935 1466.6950 1474.9522 1487.9144 1489.7444 1619.4509 1625.1481 1644.2815 1714.1379 2795.1915 2823.4695 2850.7282 2961.7013 2964.7242 2993.7236 3000.3899 3003.4611 3006.3259 3014.3814 3037.7375 3042.3455 3058.9792 3099.1310 3105.9881 3107.0239 3140.9720 3154.2993 3165.6200
redmass: 8.7850 3.8894 2.3194 2.0834 2.0323 2.6998 3.4389 3.1258 3.9579 3.9089 3.4918 4.8850 3.2188 2.8078 4.3948 4.5930 5.2010 4.9891 4.9523 3.4778 3.0652 3.0869 4.2985 3.5511 5.4125 4.1921 3.6625 4.4649 5.1392 4.3726 4.4015 6.5521 7.2355 5.3996 4.2920 4.0485 4.8296 1.9113 3.3325 3.6435 2.8943 7.7560 2.0960 1.4120 1.6219 4.0455 2.1919 2.5376 3.3718 2.5424 3.6159 4.0999 2.9915 1.9370 2.2871 3.1535 1.6720 1.6490 1.5001 1.8946 2.7974 1.2380 1.6685 2.1545 1.9461 1.6820 1.7679 1.4796 2.2966 1.5666 1.4481 1.2997 2.2669 1.4381 1.3895 3.7469 1.4563 1.4409 1.5652 1.4300 1.3411 1.5086 1.6579 1.3461 1.5884 2.1686 1.2692 5.0372 4.4261 1.0838 1.0612 1.0851 1.0524 1.1713 1.4440 1.5898 1.1929 9.8913 7.6758 9.3272 8.4573 1.0714 1.0771 1.0716 1.0807 1.0639 1.0617 1.0852 1.0607 1.0378 1.0957 1.0896 1.0857 1.1025 1.0950 1.0918 1.1093 1.1021 1.0925 1.0928
irintensity: 0.9937 1.4098 1.7629 0.6353 1.3840 9.8619 4.9978 1.4723 0.3101 2.3063 2.8387 11.4585 4.6886 1.2744 1.5292 0.4537 3.2609 2.0564 1.7056 0.4746 1.0563 9.3308 6.2524 2.1367 3.6724 1.1068 2.8533 10.8650 7.6809 7.0137 1.0747 1.6861 0.5152 0.2591 0.9299 3.7381 5.1097 7.5077 18.6943 5.1039 4.4733 25.5209 2.0761 16.8869 6.0910 50.4298 38.1119 16.7585 27.7218 8.3650 43.7437 124.1007 9.9686 82.2706 7.4961 20.4347 1.8136 9.4988 8.2528 6.0893 12.1737 8.5649 37.0042 2.7355 6.6469 31.8846 36.3692 9.5269 294.2685 6.4877 32.5458 2.9510 25.0240 7.5322 2.4093 140.0418 5.6678 0.6295 49.3930 13.5248 1.5243 4.4654 12.0208 0.6130 10.6069 5.0853 51.0085 1.5974 1.5551 10.2963 20.9028 7.6544 19.0145 41.9440 86.5376 79.2272 24.8982 0.2642 1.0618 169.0430 3.6726 69.0380 34.6036 149.2060 9.6208 36.1863 142.2103 33.5434 29.9331 2.1294 15.6691 48.7686 14.8652 28.0390 9.0002 33.8892 30.3428 9.1660 5.1789 1.1796
temp: 298.150 k
press: 1.00000 atm
elementType: 8 8 8 8 7 6 6 6 6 6 6 6 6 6 6 6 6 6 6 6 6 6 6 1 1 1 1 1 1 1 1 1 1 1 1 1 1 1 1 1 1 1
symmnumber: 1
zpe: 879732.8 jmol-1
zpe.correction: 0.335073 hartree
zpe.thermalcorrener: 0.354865 hartree
zpe.thermalcorrenthalpy: 0.355809 hartree
zpe.thermalcorrgfe: 0.285875 hartree
zpe.sumelectzpe: -1051.241952 hartree
zpe.sumelectthermal: -1051.222160 hartree
zpe.sumelectthermalent: -1051.221216 hartree
zpe.sumelectthermalfe: -1051.291149 hartree
dipole: -1.6924 -1.5122 1.3441
dipole: 2.6377
quadrupole: -118.9407 -137.0767 -129.7402
quadrupole: -1.5827 -0.1418 2.8183
quadrupole: 9.6452 -8.4908 -1.1544 -1.5827 -0.1418 2.8183
hfenergy: -1051.5770244 hartree
pointgroup: C01 [X(C18H19N1O4)]
dipole: 0.4747177 -0.7934574 -0.4711407 debye
polarizability: 246.4940991|-27.085258|222.1681343|21.6819713|15.344023|147.4383577 unknown
InChI: InChI=1S/C18H19NO4/c1-10(20)23-14-3-2-11-4-5-19-8-12-6-15-16(22-9-21-15)7-13(12)17(14)18(11)19/h2,6-7,14,17-18H,3-5,8-9H2,1H3
charge 0 multiplicity 1
42 atoms
O  1.826897 1.571711 -0.512464
O  -3.62719 2.032577 0.306667
O  -4.593254 0.145013 -0.816506
O  0.957511 3.625293 0.196958
N  0.95862 -2.598919 0.014174
C  1.637144 -1.287991 -0.039581
C  0.891523 -0.270417 0.822592
C  3.024155 -1.590361 0.471682
C  1.733327 1.019511 0.885643
C  1.972998 -3.584606 -0.439059
C  3.297697 -3.074322 0.217308
C  -0.556208 -0.172082 0.336386
C  -0.330946 -2.557396 -0.688155
C  3.173526 0.750393 1.402728
C  -1.132331 -1.29448 -0.335243
C  3.734026 -0.643139 1.12889
C  -1.341594 0.990827 0.599879
C  -2.496443 -1.265039 -0.748913
C  -2.672595 0.985445 0.189296
C  -3.241459 -0.121972 -0.471103
C  1.390223 2.886746 -0.717847
C  -4.910935 1.427168 -0.131507
C  1.496581 3.252155 -2.18177
H  1.688142 -0.896335 -1.090292
H  0.888235 -0.681497 1.855123
H  1.260246 1.801907 1.5051
H  2.076315 -3.585027 -1.554773
H  1.702895 -4.607301 -0.121931
H  4.167739 -3.247801 -0.442134
H  3.492327 -3.600561 1.169299
H  -0.922961 -3.455928 -0.427725
H  -0.18914 -2.57745 -1.803961
H  3.184257 0.92159 2.499648
H  3.8359 1.529405 0.9760
H  4.72913 -0.859371 1.541611
H  -0.916823 1.868107 1.095414
H  -2.946242 -2.117229 -1.26764
H  -5.40131 2.103692 -0.84798
H  -5.532697 1.214008 0.759276
H  0.635206 2.823962 -2.726268
H  2.414683 2.834836 -2.624996
H  1.475125 4.346177 -2.293725
