program: Gaussian 09
title: 000023446
version: EM64L-G09RevD.01
frameworkgroup: C1[X(C15H21N3O)]
method: RPBEPBE
basis: SDD
operation: Freq
keyword: #p
keyword: freq=noraman
keyword: PBEPBE/SDD
title: #p freq=noraman PBEPBE/SDD
converged: YES YES NO NO
title: Mulliken charges:
elementType: O N N N C C C C C C C C C C C C C C C H H H H H H H H H H H H H H H H H H H H H
charge: -0.249411 -0.093502 -0.401280 -0.171119 -0.503164 -0.340765 -0.336698 0.378488 0.116878 -0.325083 -0.317739 0.219207 -0.457469 -0.576942 0.429776 -0.363610 -0.360191 -0.647610 -0.649094 0.217292 0.186036 0.238601 0.187872 0.186541 0.206491 0.211435 0.193099 0.186465 0.210556 0.267763 0.297830 0.272299 0.219080 0.232924 0.225916 0.226262 0.212733 0.229840 0.228676 0.211616
chargesum: 0.00000
title: Mulliken charges with hydrogens summed into heavy atoms:
elementType: O N N N C C C C C C C C C C C C C C C
charge: -0.249411 -0.093502 -0.103449 -0.171119 -0.099836 0.085708 0.056334 0.378488 0.116878 0.079451 0.079282 0.219207 -0.189706 -0.304643 0.429776 -0.144530 -0.127267 0.017300 0.021038
polarizability: 2.18661156e+02 1.77904643e+01 2.22315608e+02 -2.04475432e+01 8.25045470e+00 1.28078174e+02
1716.lowfreq: 0.0006 0.0007 0.0009 3.9977 7.3382 14.9717 21.7262 45.6304 49.4851
frequency: 21.5473 45.5792 49.1288 54.2676 75.2597 113.8471 117.1733 156.2567 183.1762 213.5185 221.2252 242.4694 256.7387 287.9145 304.2835 313.0428 342.2399 374.0822 397.8684 407.3871 432.5638 461.1897 467.1388 480.5486 492.8162 525.1358 587.2555 594.4081 604.5454 646.2148 687.2261 743.1105 758.5105 766.8921 784.0823 796.2928 800.4615 808.1755 843.3644 853.9405 881.3738 899.8756 913.9128 962.2078 978.9316 996.4599 1028.8173 1052.8549 1053.8476 1059.3660 1083.7221 1097.8085 1104.4077 1108.1287 1112.9786 1116.9237 1146.8378 1151.0649 1171.8390 1186.1132 1210.6487 1233.0295 1252.7253 1261.8231 1265.1651 1273.7726 1288.6291 1293.9535 1322.9740 1333.4001 1341.3087 1350.9168 1355.0128 1369.8793 1386.5301 1393.7633 1421.4426 1433.3367 1443.8165 1447.9404 1452.1016 1452.8166 1456.5657 1460.5783 1466.0786 1469.4601 1470.8583 1491.3109 1501.6868 1514.2513 1564.4726 1591.9618 1643.3203 2831.4705 2848.3814 2862.2645 2920.6510 2930.7107 2946.7094 2954.8498 2970.1913 2980.5049 2982.8562 3017.1787 3044.9760 3076.2795 3081.9510 3085.7971 3095.4928 3128.2383 3167.1815 3176.5032 3215.2683 3617.5551
redmass: 4.5215 2.9047 3.1007 3.3223 2.8327 2.2715 3.6547 2.4772 3.2883 1.5885 1.4528 1.9522 2.7383 3.3178 4.4413 2.4044 3.9215 5.1898 1.8507 3.4876 2.8993 1.9806 2.6262 2.1964 3.2918 3.6866 2.8501 2.9373 2.2116 3.0936 4.6694 3.8771 4.0284 2.5787 1.8378 2.2435 2.9613 3.6033 1.5986 1.6899 4.7422 2.3396 1.3311 2.4503 1.9173 2.7585 2.1136 2.0209 2.3633 1.7105 3.6262 1.6093 2.0396 1.3092 1.2444 2.6026 1.4794 2.5107 1.5484 1.0652 1.3147 1.5812 1.7627 2.0231 1.7156 1.5029 1.3993 1.8888 1.8082 1.5750 1.3717 2.5043 1.4964 1.2722 1.6905 3.9695 1.9816 1.4066 1.0832 1.0832 1.1761 1.3184 1.1086 1.0426 2.3436 1.2023 1.0571 1.4498 1.3911 1.3398 5.8759 5.7407 7.4084 1.0709 1.0708 1.0689 1.0373 1.0401 1.0668 1.0667 1.0863 1.0984 1.1029 1.0890 1.0887 1.0959 1.0973 1.0948 1.0929 1.0892 1.0931 1.0910 1.0980 1.0808
irintensity: 0.4352 1.3013 0.0807 4.6229 2.6633 1.2257 1.7110 3.7756 2.1388 0.6128 1.5246 1.3507 1.0576 2.1012 2.6370 14.1787 0.5861 4.6158 1.7465 8.1084 1.5448 47.8762 8.6166 53.6321 0.2980 0.5933 7.1847 1.2372 11.7799 9.5818 3.5166 2.4546 1.0600 21.0671 54.7551 3.3009 13.0335 35.1135 3.3456 25.6742 1.3305 24.1836 0.8669 24.4794 7.8010 35.9476 12.9197 11.8389 24.8375 21.6188 45.9158 35.4853 1.3544 1.3015 0.1616 57.1653 2.2401 2.1263 11.7633 2.7367 1.5536 7.2212 28.2680 45.4243 15.1937 6.3765 6.8791 23.0124 16.4779 7.0513 19.8041 61.7385 3.9452 1.4459 1.7554 25.3419 0.9489 10.4579 2.3163 0.5545 3.4695 70.0160 5.7518 0.9273 20.5627 15.3651 17.9949 34.8463 1.3207 200.0846 33.2793 60.2608 90.8973 58.1699 59.7471 199.9315 139.4034 82.0875 49.4953 81.4911 27.2908 0.3948 111.0743 48.2744 22.3354 49.4073 42.1094 4.3955 56.2828 15.0886 21.0187 7.3964 1.3205 62.7629
temp: 298.150 k
press: 1.00000 atm
elementType: 8 7 7 7 6 6 6 6 6 6 6 6 6 6 6 6 6 6 6 1 1 1 1 1 1 1 1 1 1 1 1 1 1 1 1 1 1 1 1 1
symmnumber: 1
zpe: 888639.3 jmol-1
zpe.correction: 0.338465 hartree
zpe.thermalcorrener: 0.356551 hartree
zpe.thermalcorrenthalpy: 0.357495 hartree
zpe.thermalcorrgfe: 0.291392 hartree
zpe.sumelectzpe: -822.207097 hartree
zpe.sumelectthermal: -822.189011 hartree
zpe.sumelectthermalent: -822.188066 hartree
zpe.sumelectthermalfe: -822.254170 hartree
dipole: -2.2141 1.1141 -0.5891
dipole: 2.5476
quadrupole: -114.9020 -93.1798 -115.1297
quadrupole: 7.1093 -10.2218 6.8616
quadrupole: -7.1649 14.5574 -7.3925 7.1093 -10.2218 6.8616
hfenergy: -822.5455619 hartree
pointgroup: C01 [X(C15H21N3O1)]
dipole: 0.8822811 -0.411093 -0.2392334 debye
polarizability: 218.0964737|17.8940836|223.2267726|18.610026|-10.0394969|127.7316909 unknown
InChI: InChI=1S/C15H21N3O/c1-17(2)13-3-4-15-14(9-13)12(10-16-15)11-18-5-7-19-8-6-18/h3-4,9-10,16H,5-8,11H2,1-2H3
charge 0 multiplicity 1
40 atoms
O  -4.237472 1.480326 1.052548
N  -2.290756 -0.126364 -0.379579
N  1.238477 -3.147593 0.299901
N  2.652987 2.270723 -0.254437
C  -1.728752 -1.320343 -1.070885
C  -2.56063 -0.356585 1.06098
C  -3.504523 0.390289 -1.057272
C  -0.416686 -1.779664 -0.49033
C  0.775882 -0.97563 -0.263315
C  -3.028844 0.95238 1.713591
C  -3.965306 1.691015 -0.378372
C  1.795383 -1.858772 0.231002
C  -0.092471 -3.089872 -0.131195
C  1.052505 0.404936 -0.426615
C  2.348268 0.902997 -0.109027
C  3.084051 -1.384499 0.549187
C  3.351227 -0.014399 0.375235
C  3.992938 2.770258 0.05995
C  1.627066 3.187875 -0.753907
H  -1.592756 -1.029067 -2.133297
H  -2.452906 -2.17701 -1.06337
H  -1.630597 -0.70427 1.545507
H  -3.343913 -1.144006 1.209062
H  -4.342841 -0.3530 -1.02767
H  -3.267129 0.592706 -2.119931
H  -3.316422 0.795788 2.766376
H  -2.212337 1.704579 1.655096
H  -3.178122 2.467419 -0.499236
H  -4.913865 2.053409 -0.808965
H  -0.714468 -3.983376 -0.159578
H  1.721794 -3.984475 0.615737
H  0.25003 1.060814 -0.770414
H  3.868547 -2.051632 0.924731
H  4.350478 0.354247 0.622329
H  4.776583 2.297358 -0.569641
H  4.264946 2.597131 1.122755
H  4.029711 3.856858 -0.120494
H  0.731642 3.203341 -0.097155
H  1.285679 2.91402 -1.77515
H  2.034501 4.211085 -0.79495
