program: Gaussian 09
title: 000258891
version: EM64L-G09RevD.01
frameworkgroup: C1[X(C16H16ClNO4)]
method: RPBEPBE
basis: SDD
operation: Freq
keyword: #p
keyword: freq=noraman
keyword: PBEPBE/SDD
title: #p freq=noraman PBEPBE/SDD
converged: YES YES NO NO
title: Mulliken charges:
elementType: Cl O O O O N C C C C C C C C C C C C C C C C H H H H H H H H H H H H H H H H
charge: -0.019825 -0.254818 -0.256202 -0.206487 -0.207232 -0.008187 -0.457284 0.677042 -0.428993 0.454634 -0.097577 -0.556034 0.241339 0.257187 -0.367540 -0.292796 -0.238026 -0.227449 -0.262581 -0.258788 -0.661033 -0.663610 0.266252 0.251467 0.256534 0.265528 0.233112 0.235477 0.236359 0.225454 0.229089 0.238138 0.216053 0.231084 0.252015 0.219187 0.252532 0.225983
chargesum: 0.00000
title: Mulliken charges with hydrogens summed into heavy atoms:
elementType: Cl O O O O N C C C C C C C C C C C C C C C C
charge: -0.019825 -0.254818 -0.256202 -0.206487 -0.207232 -0.008187 -0.191032 0.677042 -0.428993 0.454634 -0.097577 -0.304567 0.241339 0.257187 -0.111006 -0.027268 -0.004915 0.008027 0.199232 0.208439 0.038119 0.034091
polarizability: 2.77171334e+02 -1.30722130e+01 1.67601778e+02 -1.03321615e+01 -2.11572789e+01 1.73502889e+02
1716.lowfreq: -5.3021 -3.6494 0.0027 0.0031 0.0031 1.5184 19.1906 27.1040 35.9268
frequency: 18.8767 26.9753 35.8292 40.4854 54.4624 60.6994 78.6453 93.9817 109.8663 120.7486 127.4499 143.8589 187.6227 195.0638 212.6998 217.9117 229.2657 251.7381 277.8445 314.7824 327.1853 341.2845 386.4202 398.9321 426.0420 439.6432 467.2385 510.3403 528.2308 531.0061 566.4855 571.3663 625.2038 645.1791 655.1574 702.5223 722.3910 768.7086 777.6811 789.2218 796.2552 801.2305 811.3549 818.2859 833.6592 886.2718 890.4821 921.2281 932.9922 952.8800 972.2929 999.0886 1003.9534 1015.9797 1020.3241 1038.9045 1093.5190 1096.4829 1106.4734 1125.1505 1144.8485 1156.8360 1158.5282 1161.4931 1194.6274 1221.2524 1255.5612 1262.9396 1276.3689 1277.8579 1299.6890 1339.4828 1354.0074 1355.6509 1368.7967 1376.3976 1391.1390 1393.0008 1415.6980 1453.6515 1458.3280 1458.7887 1460.9627 1462.8169 1476.5639 1481.2391 1485.1966 1549.1291 1590.5233 1621.7574 1643.9324 1656.1012 2993.6732 2994.9692 3009.8040 3030.0196 3034.6714 3088.6191 3090.2984 3096.2454 3096.3657 3105.3652 3121.9744 3122.9551 3136.2960 3150.6430 3166.3272 3175.7268
redmass: 3.9174 3.0563 4.8494 4.5016 5.2678 3.1079 5.6526 5.2166 6.2781 6.1959 4.3990 5.1811 2.0765 1.3275 2.9806 4.2765 5.9173 3.0155 2.8134 3.5031 4.7986 7.1841 9.8880 4.3138 3.2519 3.4039 5.4626 4.4829 6.6727 6.0879 6.0569 4.8181 7.6234 4.1372 7.2961 3.9324 3.8726 4.6273 1.3357 2.5578 6.2370 2.1823 1.3452 2.0220 4.1011 1.6795 6.2701 1.8191 5.2104 2.5024 1.3621 1.3286 3.0621 3.0093 2.6399 3.4952 2.3388 2.1655 2.5997 1.7648 4.8049 1.6744 1.7417 1.4282 2.0175 1.7599 1.6014 1.7124 1.1275 1.1199 2.2392 3.4177 1.2672 1.3172 2.1815 3.0780 1.2335 1.2290 3.4586 2.5968 1.0861 1.0896 1.0504 1.0469 3.1806 1.0782 1.0523 7.1109 7.8930 6.6473 10.0932 9.8308 1.0361 1.0364 1.0812 1.0597 1.0597 1.0973 1.0972 1.1028 1.1036 1.0909 1.1056 1.1068 1.0860 1.0897 1.0953 1.0999
irintensity: 0.2856 0.7128 0.9232 0.9468 1.6415 0.8893 0.3828 0.9198 0.0803 0.7860 0.8816 0.7834 1.4226 3.5552 2.1470 0.7097 2.4953 0.5842 8.4154 7.0317 12.9538 6.4081 2.6769 2.6425 6.9490 5.9946 11.1085 1.5140 6.0097 2.1715 5.2883 1.4937 5.7292 0.1925 16.0209 17.7875 19.4901 13.7351 86.6980 1.2039 11.2435 1.5010 4.0901 11.6083 10.3728 0.0487 6.3505 19.3872 11.8356 4.4354 2.3999 0.0232 8.1184 65.4554 69.4847 103.7057 149.9281 34.4473 298.9063 0.3187 174.9343 18.9347 34.9160 5.2283 19.1265 2.5620 79.1647 87.0881 8.3417 5.6665 37.9112 21.6121 0.7517 3.2680 32.1111 13.0460 23.0490 20.6463 3.6065 2.0293 14.8481 15.4879 12.1033 12.1566 44.0936 20.9771 12.3239 18.5653 14.7957 4.9988 209.7727 124.7518 20.3438 14.1887 5.2611 33.7120 25.6188 34.3087 40.5102 2.1059 0.3966 20.3572 26.4539 30.3223 3.8325 8.7150 9.6474 22.4434
temp: 298.150 k
press: 1.00000 atm
elementType: 17 8 8 8 8 7 6 6 6 6 6 6 6 6 6 6 6 6 6 6 6 6 1 1 1 1 1 1 1 1 1 1 1 1 1 1 1 1
symmnumber: 1
zpe: 757911.9 jmol-1
zpe.correction: 0.288673 hartree
zpe.thermalcorrener: 0.310302 hartree
zpe.thermalcorrenthalpy: 0.311247 hartree
zpe.thermalcorrgfe: 0.235036 hartree
zpe.sumelectzpe: -1433.414675 hartree
zpe.sumelectthermal: -1433.393046 hartree
zpe.sumelectthermalent: -1433.392102 hartree
zpe.sumelectthermalfe: -1433.468312 hartree
dipole: 0.1150 1.2358 0.8547
dipole: 1.5070
quadrupole: -113.2206 -123.7803 -137.2434
quadrupole: 7.0527 -8.9445 1.8791
quadrupole: 11.5275 0.9678 -12.4953 7.0527 -8.9445 1.8791
hfenergy: -1433.7033482 hartree
pointgroup: C01 [X(C16H16Cl1N1O4)]
dipole: -0.0699341 0.5214616 0.2733266 debye
polarizability: 274.7781184|15.0692742|162.6507635|-12.6539945|-22.690433|180.8471189 unknown
InChI: InChI=1S/C16H16ClNO4/c1-3-21-15(19)13(16(20)22-4-2)11-9-18-12-8-6-5-7-10(12)14(11)17/h5-9,13H,3-4H2,1-2H3
charge 0 multiplicity 1
38 atoms
Cl 0.101204 0.764236 -1.930414
O  -1.466204 2.071086 1.053284
O  -2.905397 -1.928928 0.75458
O  -2.997335 0.966544 -0.322268
O  -1.216021 -2.136477 -0.844663
N  2.478363 -0.505979 1.877362
C  -1.175847 -0.292099 0.834281
C  0.331266 -0.158433 0.699979
C  1.020865 0.251569 -0.44346
C  2.453705 0.296632 -0.482549
C  3.148818 -0.102488 0.730228
C  1.13959 -0.52407 1.834861
C  -1.989259 0.955429 0.41125
C  -1.729565 -1.543051 0.124039
C  3.223463 0.699838 -1.619995
C  4.578788 -0.081376 0.756713
C  4.618961 0.708754 -1.562225
C  5.303346 0.31691 -0.368303
C  -2.146386 3.381593 0.786034
C  -3.644462 -3.080753 0.143576
C  -1.580267 4.039713 -0.473762
C  -3.118038 -4.411412 0.687001
H  -1.407003 -0.419693 1.910123
H  0.62975 -0.84523 2.753197
H  2.703591 0.996176 -2.535893
H  5.067526 -0.38844 1.686129
H  5.197238 1.017074 -2.439855
H  6.398219 0.329682 -0.341799
H  -3.231387 3.197292 0.695232
H  -1.932467 3.966756 1.694437
H  -4.690567 -2.894292 0.432733
H  -3.534741 -3.018588 -0.952967
H  -2.037516 5.038275 -0.60418
H  -0.487012 4.166054 -0.39587
H  -1.804744 3.436054 -1.368331
H  -3.729356 -5.24199 0.287843
H  -2.072298 -4.575163 0.377869
H  -3.176815 -4.43981 1.788787
