program: Gaussian 09
title: 000258875
version: EM64L-G09RevD.01
frameworkgroup: C1[X(C16H26N2O2)]
method: RPBEPBE
basis: SDD
operation: Freq
keyword: #p
keyword: freq=noraman
keyword: PBEPBE/SDD
title: #p freq=noraman PBEPBE/SDD
converged: YES YES NO NO
title: Mulliken charges:
elementType: O O N N C C C C C C C C C C C C C C C C H H H H H H H H H H H H H H H H H H H H H H H H H H
charge: -0.481344 -0.476963 -0.096167 -0.161498 -0.383666 -0.380697 -0.374399 -0.348485 -0.349822 0.293050 -0.413403 -0.205934 -0.720649 -0.720106 0.453556 -0.426285 -0.403669 -0.231181 -0.221221 -0.243837 0.179787 0.271236 0.205775 0.185915 0.195527 0.214599 0.213958 0.197802 0.207755 0.191295 0.205823 0.244017 0.207486 0.193686 0.202924 0.262938 0.234807 0.207340 0.209031 0.333120 0.353588 0.226490 0.280304 0.221171 0.221910 0.224437
chargesum: 0.00000
title: Mulliken charges with hydrogens summed into heavy atoms:
elementType: O O N N C C C C C C C C C C C C C C C C
charge: -0.148224 -0.123375 -0.096167 -0.161498 0.067357 0.010992 0.035727 0.063275 0.049229 0.293050 0.036436 0.001552 -0.061102 -0.068929 0.453556 -0.199795 -0.123364 -0.010011 0.000690 -0.019400
polarizability: 2.63856747e+02 3.74462224e+00 1.73780950e+02 1.50450009e+01 -4.61500247e+00 1.44119517e+02
1716.lowfreq: -17.3323 -7.3414 -0.0003 0.0005 0.0007 0.9029 20.3936 25.8672 32.0750
frequency: 19.6079 25.6724 32.0301 37.8082 55.5976 67.6262 91.1580 114.5916 172.8949 203.4721 213.1096 216.3122 238.4301 246.3835 248.1670 271.7450 281.6942 294.3325 327.4007 339.3692 361.9397 373.9329 383.6114 404.7186 408.6054 417.6675 448.8896 483.1993 500.8217 537.7418 555.6942 601.7128 615.8336 629.5184 705.1593 720.7391 740.0249 751.1939 761.8567 784.7394 829.4022 844.0077 857.6586 859.1043 886.9464 894.6372 912.6835 922.2863 934.9612 970.9645 979.7585 988.9887 996.6384 999.1105 1003.9055 1021.4827 1023.5567 1030.1721 1037.0671 1057.6825 1081.3282 1094.9062 1105.3515 1127.5881 1132.0155 1136.3957 1149.8276 1169.2034 1175.6318 1180.3804 1194.9787 1195.4428 1206.4716 1228.8324 1258.7860 1268.7956 1281.8725 1291.8921 1307.7918 1312.3420 1319.1373 1327.3481 1328.3439 1337.5103 1352.4505 1369.9449 1372.4479 1375.6467 1384.5459 1386.9425 1395.7348 1397.4440 1437.7934 1445.4464 1449.4809 1451.9558 1454.7951 1458.5821 1465.8986 1467.4326 1471.5862 1473.3297 1482.7974 1484.0534 1593.9884 1614.3562 2850.6032 2858.3473 2888.9418 2897.8246 2903.0260 2908.5587 2926.0218 2971.5005 2976.0058 3023.9729 3030.9160 3039.1082 3043.1374 3048.6303 3059.9280 3069.8660 3083.2846 3083.8448 3103.8189 3106.8819 3122.8292 3136.4116 3154.9288 3169.2169 3203.4195 3545.6249
redmass: 4.2743 3.6530 4.8340 3.2857 3.9702 4.0185 4.0390 4.4885 3.2722 2.0556 1.5595 2.9447 1.5073 2.7540 1.4925 2.5827 1.0799 3.4048 2.3318 2.5629 2.5390 3.8539 2.2102 2.8603 2.1135 3.2233 2.9062 2.7942 3.0630 3.2595 3.0000 3.4001 6.3227 2.5651 1.7365 1.1088 4.4116 2.9097 2.1349 3.2752 3.3425 1.5726 1.2611 2.5316 2.4421 2.1924 1.5254 1.4823 1.9498 1.5986 1.3635 5.6920 1.4316 1.4380 2.2503 2.3138 2.3450 3.0661 2.2858 1.7770 1.6918 1.9130 1.7799 2.4291 2.4031 1.8822 2.5313 1.0711 1.4518 1.3169 1.3411 1.8290 2.4413 1.9276 1.2550 1.3162 1.3634 1.2760 1.3661 1.3608 1.3211 1.2375 1.7342 1.3408 1.3858 1.2414 1.4497 1.4833 1.3625 6.1672 1.3180 1.5258 2.1639 1.0830 1.0910 1.0571 1.0823 1.0712 1.0667 1.0951 1.0776 1.0777 2.3592 1.0875 6.2308 6.1517 1.0709 1.0700 1.0689 1.0691 1.0682 1.0809 1.0687 1.0368 1.0368 1.0909 1.0894 1.0910 1.0917 1.0936 1.0985 1.0980 1.0893 1.0998 1.0983 1.0873 1.0865 1.0928 1.0976 1.0969 1.0636 1.0657
irintensity: 0.0233 0.1950 0.5595 0.3326 0.9704 1.5113 2.7248 2.3350 5.7970 0.5628 0.8042 2.7246 0.4133 4.2932 8.1971 0.2530 110.7420 1.5263 7.0964 14.3755 14.6769 0.9714 10.5591 0.1142 1.4095 8.2826 8.3691 0.4889 0.1657 14.1859 7.1503 2.7820 0.0083 6.6657 20.3499 98.9311 7.9109 7.1001 43.2545 25.2104 17.7041 0.8022 0.9610 14.3827 12.8110 8.4454 3.5806 6.5881 4.0915 4.3302 0.1271 0.0381 5.2815 9.1218 66.0325 22.6605 21.4115 16.5485 20.1295 8.5268 16.2736 30.3573 66.5759 57.7403 25.2884 47.7525 62.2700 1.2602 7.5306 2.9450 8.1945 22.1899 20.3665 6.9957 8.4727 14.9924 3.5614 15.8564 12.0685 15.2363 21.2592 20.6327 29.5199 17.3397 7.8541 33.8394 3.1650 10.9305 22.2842 6.3698 2.9770 70.0245 12.8644 0.3443 5.6707 1.1587 5.4061 0.8022 5.8637 32.7916 9.6427 2.9779 17.8256 22.8489 0.4304 10.3405 53.1240 81.0924 89.9782 29.7876 123.9869 52.6687 93.0685 16.9667 43.5716 1.3330 61.8833 24.8976 28.8026 34.4216 6.6984 67.3073 6.2478 31.2985 17.1548 12.9134 1.2140 35.8339 33.9762 12.6282 275.9299 6.1011
temp: 298.150 k
press: 1.00000 atm
elementType: 8 8 7 7 6 6 6 6 6 6 6 6 6 6 6 6 6 6 6 6 1 1 1 1 1 1 1 1 1 1 1 1 1 1 1 1 1 1 1 1 1 1 1 1 1 1
symmnumber: 1
zpe: 1040401.2 jmol-1
zpe.correction: 0.396268 hartree
zpe.thermalcorrener: 0.417011 hartree
zpe.thermalcorrenthalpy: 0.417955 hartree
zpe.thermalcorrgfe: 0.345072 hartree
zpe.sumelectzpe: -883.651356 hartree
zpe.sumelectthermal: -883.630613 hartree
zpe.sumelectthermalent: -883.629669 hartree
zpe.sumelectthermalfe: -883.702552 hartree
dipole: 4.2731 2.1941 -1.8216
dipole: 5.1373
quadrupole: -109.4170 -118.9213 -124.7915
quadrupole: 0.5657 6.5601 3.2837
quadrupole: 8.2929 -1.2113 -7.0815 0.5657 6.5601 3.2837
hfenergy: -884.0476241 hartree
pointgroup: C01 [X(C16H26N2O2)]
dipole: -1.6818379 -1.1048545 -0.1891736 debye
polarizability: 263.954623|-4.4384964|170.2564652|-14.4597243|-10.6594524|147.5461262 unknown
InChI: InChI=1S/C16H26N2O2/c1-16(2,20)13-18-10-8-17(9-11-18)12-15(19)14-6-4-3-5-7-14/h3-7,15,19-20H,8-13H2,1-2H3
charge 0 multiplicity 1
46 atoms
O  -5.212011 0.49237 -1.60903
O  1.961229 1.571315 0.901368
N  -2.933664 0.020666 0.318627
N  -0.052034 0.04854 0.008506
C  -2.28888 0.78884 -0.777461
C  -2.040411 -0.042218 1.499252
C  -0.955622 0.136753 -1.171719
C  -0.70312 -0.699374 1.117746
C  -4.304276 0.474963 0.635347
C  -5.419191 -0.123618 -0.264304
C  1.314844 -0.438778 -0.306378
C  2.314437 0.165789 0.734826
C  -5.309012 -1.656235 -0.37505
C  -6.801012 0.316934 0.27033
C  3.755052 0.014461 0.269881
C  4.417041 -1.230913 0.414342
C  4.437293 1.093761 -0.341394
C  5.737079 -1.401009 -0.059875
C  5.759262 0.925523 -0.812074
C  6.412316 -0.322157 -0.677606
H  -2.094716 1.846368 -0.463032
H  -2.976508 0.805862 -1.637441
H  -2.526465 -0.645322 2.288723
H  -1.829439 0.973895 1.921186
H  -1.160712 -0.874522 -1.597011
H  -0.458194 0.745786 -1.94849
H  -0.030121 -0.698152 1.994383
H  -0.889876 -1.759328 0.821191
H  -4.397457 1.587183 0.586624
H  -4.534598 0.174007 1.675189
H  1.392705 -1.549661 -0.324215
H  1.591257 -0.058015 -1.306478
H  2.193036 -0.370272 1.703983
H  -6.073889 -2.056545 -1.068845
H  -5.462668 -2.137448 0.608682
H  -4.304098 -1.927445 -0.737279
H  -6.862516 1.419202 0.311687
H  -7.609605 -0.04713 -0.391879
H  -6.990856 -0.086296 1.282151
H  -5.882305 0.110762 -2.232117
H  0.970438 1.57827 0.69586
H  3.90526 -2.067258 0.908672
H  3.922511 2.056426 -0.414852
H  6.240642 -2.367423 0.058639
H  6.28318 1.768782 -1.277109
H  7.438577 -0.450537 -1.040456
