program: Gaussian 09
title: 000258860
version: EM64L-G09RevD.01
frameworkgroup: C1[X(C10H24N2O2)]
method: RPBEPBE
basis: SDD
operation: Freq
keyword: #p
keyword: freq=noraman
keyword: PBEPBE/SDD
title: #p freq=noraman PBEPBE/SDD
converged: YES YES NO NO
title: Mulliken charges:
elementType: O O N N C C C C C C C C C C H H H H H H H H H H H H H H H H H H H H H H H H
charge: -0.303741 -0.480925 -0.410768 -0.576752 -0.054321 -0.255855 -0.353502 -0.048139 -0.271807 -0.428561 -0.718022 -0.718337 -0.310899 -0.393234 0.183864 0.183541 0.195775 0.221376 0.187691 0.199542 0.211126 0.188729 0.227021 0.218699 0.202518 0.208122 0.232202 0.275194 0.215438 0.223574 0.204559 0.222358 0.216663 0.193845 0.203823 0.364193 0.265791 0.279218
chargesum: 0.00000
title: Mulliken charges with hydrogens summed into heavy atoms:
elementType: O O N N C C C C C C C C C C
charge: -0.303741 -0.116733 -0.135574 -0.031742 0.129543 0.123461 0.055566 0.151403 0.128048 0.017158 -0.075180 -0.074766 0.128121 0.004435
polarizability: 1.55158943e+02 -1.79204918e+00 1.20006184e+02 1.66907649e+00 2.16354672e-01 1.19446216e+02
1716.lowfreq: -3.4693 0.0006 0.0007 0.0008 3.9206 15.7672 19.7938 27.0407 32.1268
frequency: 18.7620 26.8882 31.8677 43.5774 58.8524 64.1098 88.2204 119.3176 138.4139 144.4639 183.3499 189.0130 205.9008 211.5232 233.2183 249.3597 283.6012 304.1860 365.3758 388.7412 400.6958 417.4687 441.2312 468.1399 585.7219 594.8164 603.2687 697.0238 764.0450 773.6438 792.2226 802.2317 837.9139 892.3367 898.5083 921.6504 946.1978 962.2333 965.2329 986.9014 1015.0552 1037.8794 1045.9495 1056.0640 1066.3587 1083.8600 1097.8300 1113.3335 1122.3105 1127.9444 1136.7361 1156.9377 1178.9885 1197.9893 1222.4224 1230.1910 1256.1225 1260.4129 1285.0014 1290.0748 1292.9148 1295.7873 1323.0974 1333.3075 1339.6126 1344.1678 1346.9916 1378.1087 1388.4941 1390.4123 1396.2143 1431.8609 1446.0780 1457.5611 1462.9508 1467.3196 1475.6044 1477.9355 1480.3755 1485.0609 1485.6547 1490.9525 1497.2203 1644.0475 2900.8542 2912.9141 2929.7868 2938.7099 2943.4677 2957.2186 2964.2300 2971.0079 2972.6998 2976.5875 2980.4416 2991.6748 2999.8102 3030.7130 3036.6116 3050.1970 3067.4686 3067.8032 3073.8385 3085.3466 3152.7640 3461.6927 3471.1986 3598.4431
redmass: 3.4522 3.7795 2.5855 2.6995 3.0968 2.8582 2.7307 2.9862 2.6882 2.5736 1.9957 1.9073 1.2882 1.3039 1.6964 2.2058 2.2582 3.2253 2.1803 3.9356 3.0481 2.9930 2.5455 2.2461 2.6140 1.2975 3.3037 1.3382 1.7622 1.1864 1.4352 1.1394 2.5373 2.1420 2.2405 2.3614 1.3815 1.7016 1.2989 2.0007 1.7830 3.2137 3.0508 3.3419 2.4603 1.8728 2.2273 2.7239 2.1072 2.0267 2.3785 1.2652 1.9543 1.4373 1.1528 1.2604 1.3258 1.2302 1.0938 1.2936 1.2031 1.1337 1.2719 1.3541 1.3091 1.3392 1.5850 1.2525 1.2209 1.4502 1.3273 1.6045 1.2343 1.0999 1.0702 1.0600 1.0624 1.0577 1.0738 1.0581 1.0671 1.0885 1.0645 1.0932 1.0690 1.0566 1.0605 1.0752 1.0681 1.0839 1.0987 1.0609 1.0386 1.0412 1.0582 1.1066 1.0897 1.0988 1.0986 1.1020 1.0992 1.0991 1.1000 1.0995 1.0632 1.0752 1.0452 1.0979
irintensity: 0.5442 0.2774 0.5155 1.9899 1.7086 3.5026 0.3623 3.8743 5.2614 4.3797 6.5814 8.6112 5.7032 56.7989 0.3732 0.7000 2.5641 7.6850 1.1742 1.8328 1.1104 12.9194 0.4481 0.5416 9.7967 242.7653 9.7792 56.1806 7.8105 79.7201 4.7552 1.1730 27.0379 3.6239 13.2043 9.4470 1.2877 2.2135 7.6265 6.4426 64.6893 73.7589 37.5568 67.2827 6.0793 17.1983 18.7628 22.2067 0.3083 24.8421 40.6828 7.6165 5.2006 6.4538 5.1168 21.7410 4.2746 1.5694 0.2945 2.5322 4.8031 18.3890 4.9879 17.3607 19.8763 7.3436 1.8356 0.9704 26.9468 6.8774 18.6176 62.4719 9.4477 18.6801 3.7669 6.4051 5.5373 14.6815 1.1195 10.4823 16.7635 8.3063 8.3422 42.2126 69.6526 37.0890 47.0498 21.8421 116.2578 49.1045 61.1908 53.0084 73.3100 16.4105 42.4556 62.8702 9.1877 66.4790 6.2282 42.8735 31.4165 57.4273 72.6539 54.8100 220.9959 0.1771 0.3333 0.9824
temp: 298.150 k
press: 1.00000 atm
elementType: 8 8 7 7 6 6 6 6 6 6 6 6 6 6 1 1 1 1 1 1 1 1 1 1 1 1 1 1 1 1 1 1 1 1 1 1 1 1
symmnumber: 1
zpe: 889716.0 jmol-1
zpe.correction: 0.338875 hartree
zpe.thermalcorrener: 0.357449 hartree
zpe.thermalcorrenthalpy: 0.358393 hartree
zpe.thermalcorrgfe: 0.289208 hartree
zpe.sumelectzpe: -654.173296 hartree
zpe.sumelectthermal: -654.154722 hartree
zpe.sumelectthermalent: -654.153778 hartree
zpe.sumelectthermalfe: -654.222963 hartree
dipole: 1.0241 -0.7570 1.5001
dipole: 1.9678
quadrupole: -69.3489 -97.7033 -86.5738
quadrupole: -4.5497 0.9813 6.6055
quadrupole: 15.1931 -13.1613 -2.0318 -4.5497 0.9813 6.6055
hfenergy: -654.5121711 hartree
pointgroup: C01 [X(C10H24N2O2)]
dipole: 0.3537637 0.1132064 0.6792559 debye
polarizability: 153.3013168|7.2116437|121.6050411|3.9782547|0.786311|119.7049853 unknown
InChI: InChI=1S/C10H24N2O2/c1-3-9(2)7-14-8-10(13)6-12-5-4-11/h9-10,12-13H,3-8,11H2,1-2H3
charge 0 multiplicity 1
38 atoms
O  -1.459565 -0.044631 -0.37824
O  1.493277 1.656143 -1.797894
N  2.599408 1.306133 0.574814
N  5.864062 -0.613127 0.517726
C  -3.586164 -0.974318 0.391555
C  -2.916289 0.072267 -0.519522
C  -3.183815 -2.42691 0.01554
C  0.759414 0.713464 -0.955583
C  -0.734548 0.913801 -1.219257
C  1.144982 0.990087 0.528431
C  -3.280016 -0.682773 1.879982
C  -3.596165 -2.856616 -1.409196
C  3.507449 0.131627 0.618023
C  4.98016 0.566424 0.475484
H  -4.681311 -0.867894 0.228189
H  -3.238489 1.097531 -0.225728
H  -3.201654 -0.082618 -1.58373
H  -2.087957 -2.526904 0.131859
H  -3.6499 -3.113401 0.750904
H  1.02901 -0.33213 -1.221912
H  -0.955753 0.738405 -2.293954
H  -1.023244 1.95928 -0.970106
H  0.856983 0.130737 1.167279
H  0.591397 1.881802 0.877311
H  -3.621809 0.328388 2.17199
H  -3.783429 -1.415707 2.537152
H  -2.192348 -0.739776 2.063014
H  2.827213 1.98426 1.312579
H  -3.359204 -3.92236 -1.583524
H  -3.064293 -2.271392 -2.181307
H  -4.68343 -2.722964 -1.56988
H  3.399297 -0.463968 1.551102
H  3.241106 -0.534273 -0.225519
H  5.246947 1.220431 1.329797
H  5.073476 1.185897 -0.447559
H  2.29196 1.88395 -1.213562
H  5.766351 -1.241107 -0.285525
H  6.843587 -0.409956 0.731167
