program: Gaussian 09
title: 000258855
version: EM64L-G09RevD.01
frameworkgroup: C1[X(C8H20N2O2)]
method: RPBEPBE
basis: SDD
operation: Freq
keyword: #p
keyword: freq=noraman
keyword: PBEPBE/SDD
title: #p freq=noraman PBEPBE/SDD
converged: YES YES NO NO
title: Mulliken charges:
elementType: O O N N C C C C C C C C H H H H H H H H H H H H H H H H H H H H
charge: -0.307724 -0.465382 -0.316636 -0.581475 -0.085362 -0.399922 -0.278518 -0.318173 -0.201477 -0.389058 -0.383422 -0.680059 0.189190 0.214936 0.223476 0.194672 0.220792 0.237921 0.167984 0.232541 0.183164 0.181803 0.225375 0.167461 0.215333 0.210490 0.356301 0.209674 0.225116 0.209555 0.262719 0.278702
chargesum: 0.00000
title: Mulliken charges with hydrogens summed into heavy atoms:
elementType: O O N N C C C C C C C C
charge: -0.307724 -0.109081 -0.078715 -0.040054 0.103828 0.038491 0.136946 0.082352 0.163490 0.003779 0.042401 -0.035714
polarizability: 1.42010979e+02 3.44613346e-01 1.03274229e+02 -1.77981598e+00 4.56271829e-01 8.83720034e+01
1716.lowfreq: -10.3636 -5.9292 -0.0008 -0.0007 0.0004 1.3977 26.0629 34.5486 47.6082
frequency: 26.0468 34.4632 47.5947 62.1078 81.3717 88.5090 116.1134 122.2528 143.8409 159.0205 200.0792 216.2111 224.0298 226.7987 290.2458 332.7115 379.9549 418.5601 462.2669 498.1633 512.9443 555.3370 583.4009 711.5408 763.5503 812.8906 851.8106 887.8481 893.5934 903.0037 936.2436 956.2814 1006.0549 1038.0287 1049.3556 1051.2676 1061.5691 1093.0936 1106.3763 1122.6317 1134.0979 1142.8541 1148.7118 1156.9928 1190.3495 1218.6269 1226.1241 1253.8997 1260.4873 1277.2993 1281.1322 1293.8662 1306.0006 1318.8778 1336.1366 1363.5084 1387.2662 1394.1646 1400.8780 1411.1478 1449.1080 1461.9128 1475.2499 1477.3791 1479.5434 1482.5486 1486.7900 1492.4885 1493.7080 1637.7794 2838.4195 2846.7570 2901.3033 2916.1182 2926.9557 2944.1923 2964.9982 2977.1741 2999.0236 3021.5451 3027.8858 3032.6421 3047.6763 3051.1417 3077.1747 3080.5876 3411.0261 3471.2704 3515.4053 3600.1345
redmass: 4.0019 2.6463 1.7748 1.9642 3.7305 3.4640 2.7844 2.7710 3.2846 2.4340 2.2869 1.2723 1.4486 2.0076 4.4807 3.3222 3.3020 3.2500 1.9059 1.2904 3.6896 2.7775 1.4514 1.2603 1.0763 1.1144 2.5199 1.1768 2.0698 1.7893 3.0213 1.6175 2.8754 1.9252 3.8315 2.6275 3.5785 2.2110 2.6669 1.8590 1.8860 1.4743 3.1946 1.4640 1.4611 1.3482 1.2723 1.1417 1.2830 1.1040 1.0950 1.2219 1.2241 1.3600 1.2831 1.3811 1.3885 1.3363 1.4444 1.7924 1.2289 1.0881 1.0587 1.0759 1.0424 1.0706 1.0867 1.0851 1.0846 1.0953 1.0722 1.0715 1.0698 1.0553 1.0811 1.0609 1.1056 1.0359 1.0601 1.0985 1.0945 1.0844 1.1014 1.0913 1.1022 1.0989 1.0734 1.0449 1.0649 1.0981
irintensity: 0.6434 0.7875 2.9666 3.7830 0.0698 1.1933 0.8416 3.1705 10.3688 2.4404 4.3221 0.4085 27.1453 25.3771 6.3378 7.8260 3.2327 0.7350 40.0270 126.3483 19.3954 34.2873 222.9165 101.7732 6.8283 1.3135 3.1188 1.4337 16.5089 8.5361 20.3564 2.0195 25.1377 24.5746 99.8553 21.9429 129.6151 8.1548 25.9243 3.1734 3.1194 0.6966 53.9718 5.5581 9.7656 4.4177 0.7959 24.3048 19.8669 0.0375 8.8056 9.9462 4.7694 16.2695 1.8252 10.3495 4.5545 3.7681 12.2366 21.5682 38.2524 11.4592 1.5506 3.8557 12.6653 1.5025 5.8243 15.1899 6.1468 46.0289 170.6272 92.7912 89.2351 54.6780 27.1117 74.0446 48.3977 39.2256 28.5061 19.1584 51.5431 30.4664 1.7561 52.4113 85.9074 44.7496 2.4999 0.5505 19.5120 0.8160
temp: 298.150 k
press: 1.00000 atm
elementType: 8 8 7 7 6 6 6 6 6 6 6 6 1 1 1 1 1 1 1 1 1 1 1 1 1 1 1 1 1 1 1 1
symmnumber: 1
zpe: 742387.7 jmol-1
zpe.correction: 0.282761 hartree
zpe.thermalcorrener: 0.298966 hartree
zpe.thermalcorrenthalpy: 0.299910 hartree
zpe.thermalcorrgfe: 0.236928 hartree
zpe.sumelectzpe: -575.725465 hartree
zpe.sumelectthermal: -575.709260 hartree
zpe.sumelectthermalent: -575.708316 hartree
zpe.sumelectthermalfe: -575.771297 hartree
dipole: -0.2994 -2.4935 -1.1503
dipole: 2.7623
quadrupole: -59.4215 -80.8635 -76.0505
quadrupole: -0.9759 9.4720 0.1156
quadrupole: 12.6903 -8.7517 -3.9387 -0.9759 9.4720 0.1156
hfenergy: -576.0082253 hartree
pointgroup: C01 [X(C8H20N2O2)]
dipole: 0.1018457 0.9903512 -0.4357789 debye
polarizability: 142.0220165|0.7994723|103.2998129|1.3605194|-0.1736244|88.3353813 unknown
InChI: InChI=1S/C8H20N2O2/c1-2-5-12-7-8(11)6-10-4-3-9/h8,10-11H,2-7,9H2,1H3
charge 0 multiplicity 1
32 atoms
O  -2.143777 -0.260653 -0.27358
O  -0.578789 -2.520597 0.058549
N  2.239542 -0.110912 -0.364369
N  5.658417 1.406342 0.163271
C  0.03269 -1.247914 -0.349188
C  1.487089 -1.280561 0.142974
C  -0.769472 -0.076877 0.228073
C  3.5981 0.038095 0.19995
C  -3.093998 0.718893 0.268486
C  4.282948 1.302359 -0.354726
C  -4.476333 0.414798 -0.31798
C  -5.547331 1.409875 0.18034
H  0.011465 -1.163612 -1.460264
H  1.494436 -1.250743 1.249288
H  1.924741 -2.26295 -0.155123
H  -0.76516 -0.119789 1.339547
H  -0.346351 0.89177 -0.104321
H  2.267194 -0.1080 -1.395264
H  4.253081 -0.849887 -0.002213
H  3.521611 0.131505 1.298467
H  -2.768571 1.747172 -0.007259
H  -3.112959 0.652421 1.3801
H  3.709433 2.185484 -0.020491
H  4.218133 1.281724 -1.473582
H  -4.406474 0.447188 -1.421482
H  -4.75962 -0.619484 -0.045006
H  -1.558977 -2.402401 -0.05942
H  -5.297505 2.448023 -0.109232
H  -6.536533 1.170559 -0.24878
H  -5.64282 1.38021 1.282173
H  6.28204 0.650063 -0.133328
H  6.089251 2.328798 0.065192
