program: Gaussian 09
title: 000258811
version: EM64L-G09RevD.01
frameworkgroup: C1[X(C8H5ClN2O)]
method: RPBEPBE
basis: SDD
operation: Freq
keyword: #p
keyword: freq=noraman
keyword: PBEPBE/SDD
title: #p freq=noraman PBEPBE/SDD
converged: NO YES NO NO
title: Mulliken charges:
elementType: Cl O N N C C C C C C C C H H H H H
charge: 0.003288 -0.157702 0.081079 -0.036040 0.488117 0.144594 -0.751694 -0.352547 -0.334287 -0.016776 -0.208543 -0.213758 0.331304 0.253350 0.278128 0.244548 0.246939
chargesum: 0.00000
title: Mulliken charges with hydrogens summed into heavy atoms:
elementType: Cl O N N C C C C C C C C
charge: 0.003288 -0.157702 0.081079 -0.036040 0.488117 0.144594 -0.420390 -0.099197 -0.056159 -0.016776 0.036005 0.033182
polarizability: 1.35449908e+02 -1.26099362e+00 1.28666807e+02 -4.34756869e+00 -8.18014340e+00 6.40095422e+01
1716.lowfreq: -0.0023 -0.0021 0.0013 5.6815 7.5766 10.2673 39.3457 98.5301 129.5016
frequency: 39.3372 98.5266 129.4993 194.7012 259.1420 276.0379 349.8200 413.2824 435.8418 463.8542 486.8921 513.5891 560.1061 632.5077 666.3568 693.1956 751.0612 775.5026 787.1831 828.3560 865.4536 900.7682 922.2554 978.5635 1008.2858 1032.8679 1104.0568 1164.0546 1178.6115 1209.0917 1215.5541 1253.1489 1306.0023 1393.7064 1431.7071 1443.8122 1476.9609 1584.4041 1602.6188 1634.6308 3120.7553 3137.9174 3148.4580 3160.3963 3174.5257
redmass: 14.2491 6.2195 6.3086 10.4914 7.4378 6.7272 7.4556 4.1956 7.6601 7.3901 7.0461 6.3037 8.6877 5.3962 6.4836 5.6388 6.8343 1.3873 4.6558 6.1701 5.2584 1.4620 7.3349 1.3983 1.3562 2.1925 2.0598 1.1129 1.0709 2.6309 1.6962 1.9068 1.7034 9.0902 4.7001 2.3900 2.8458 7.0824 6.4758 12.2534 1.0885 1.0871 1.0900 1.0949 1.1007
irintensity: 0.0797 0.6000 0.5360 0.6832 1.4572 9.4919 2.4519 1.9299 4.1308 1.9655 10.6419 3.6208 12.3275 97.6375 4.6733 2.5883 6.9340 44.1582 0.3013 5.7948 47.4777 0.5782 7.9696 1.9102 0.4821 0.2380 1.9357 14.2774 0.6592 11.9417 35.3577 37.0991 7.5464 3.8621 36.1319 9.1341 1.6589 0.2696 60.9328 165.0480 1.5223 0.5783 5.2562 5.6113 17.4715
temp: 298.150 k
press: 1.00000 atm
elementType: 17 8 7 7 6 6 6 6 6 6 6 6 1 1 1 1 1
symmnumber: 1
zpe: 297890.5 jmol-1
zpe.correction: 0.113460 hartree
zpe.thermalcorrener: 0.123024 hartree
zpe.thermalcorrenthalpy: 0.123968 hartree
zpe.thermalcorrgfe: 0.077380 hartree
zpe.sumelectzpe: -951.740666 hartree
zpe.sumelectthermal: -951.731103 hartree
zpe.sumelectthermalent: -951.730159 hartree
zpe.sumelectthermalfe: -951.776747 hartree
dipole: 5.2871 -4.4542 0.8840
dipole: 6.9695
quadrupole: -72.5013 -80.8007 -77.2226
quadrupole: 2.2001 0.6114 -2.9155
quadrupole: 4.3403 -3.9592 -0.3810 2.2001 0.6114 -2.9155
hfenergy: -951.8541266 hartree
pointgroup: C01 [X(C8H5Cl1N2O1)]
dipole: 2.5399678 -0.9479569 0.4106971 debye
dipolederiv: -0.3222126 -0.0964412 -0.0728446 -0.1767436 -0.3134035 -0.1121337 -0.2938269 -0.3531894 -0.3587602 -0.526505 0.0588393 -0.0281678 0.3161623 -0.8382542 0.1348245 -0.0630374 0.2169167 -0.3669174 -0.0533969 -0.2028531 -0.2587697 -0.3184225 0.1530801 0.1817805 -0.1138103 0.0772834 -0.236752 -0.1450873 -0.1125348 -0.003259 0.1378001 -0.3399306 -0.0820647 -0.0621658 0.1086344 -0.0983489 0.0021581 -0.0259879 0.0401337 -0.1399052 -0.0589344 -0.0421882 0.2291598 0.0221473 -0.0972142 -0.5580686 0.2224465 -0.0077375 0.1789223 -0.2244345 0.0718464 0.0238349 0.01871 -0.0338992 0.4460485 0.3772349 0.2758337 0.3521564 0.3708849 0.1026417 0.3973193 0.2040232 0.6121758 -0.3269295 0.0507086 -0.0163017 -0.079504 0.1474126 -0.0448723 -0.0257427 -0.0162967 -0.1024688 -0.0440803 -0.1898231 0.0091041 0.0944385 0.1146942 -0.0304722 -0.0887681 -0.0222288 -0.0748129 1.0806673 -0.2088866 0.0661919 -0.399988 1.0361258 -0.2431838 0.0558828 -0.3032116 0.4037248 0.1997001 -0.0732141 0.0230282 -0.0078083 0.0331388 -0.0212138 -0.0180475 -0.0131675 -0.1009177 0.1246307 0.1642962 -0.0320688 0.0712551 -0.1416157 -0.0220947 -0.0341873 -0.0068049 -0.1316183 0.0318038 0.0321478 -0.0082727 -0.0211037 0.002561 0.0126277 -0.0570064 -0.0121289 -0.012125 0.0917592 -0.0344822 0.0112276 0.0046725 -0.0562597 0.0365021 -0.0066898 0.0268831 0.1393986 0.1063823 0.0371968 -0.0027702 -0.0190275 0.0012425 0.0221013 0.0230285 0.0240789 0.1526532 -0.0520451 0.0743426 -0.0128479 0.0830816 0.0582554 0.016205 0.0040639 0.0124141 0.1508308 -0.0548247 -0.0729897 0.0175208 -0.0759858 0.0554373 0.0196941 0.0299931 0.0159366 0.1550515 unknown
polarizability: 135.2753938|1.5101514|129.9005952|3.6865228|-1.7005381|62.9502685 unknown
InChI: InChI=1S/C8H5ClN2O/c9-7-5-3-1-2-4-6(5)8(12)11-10-7/h1-4,7H
charge 0 multiplicity 1
17 atoms
Cl -1.558802 -2.169247 -1.371241
O  -1.196131 2.506347 -0.548371
N  -2.21659 -0.595428 0.756949
N  -2.203761 0.676105 0.559278
C  0.295772 -0.750763 0.208073
C  0.293491 0.654125 -0.027183
C  -1.020046 -1.445959 0.324696
C  1.525798 -1.440167 0.305268
C  1.513739 1.357775 -0.181555
C  -1.00411 1.362224 -0.0831
C  2.740063 -0.734356 0.157289
C  2.735429 0.661721 -0.092183
H  -1.017711 -2.328082 0.977951
H  1.533809 -2.521632 0.480202
H  1.482422 2.436696 -0.365033
H  3.691931 -1.270661 0.232141
H  3.682203 1.198002 -0.212882
