program: Gaussian 09
title: 000259006
version: EM64L-G09RevD.01
frameworkgroup: C1[X(C20H24N2O8S4)]
method: RPBEPBE
basis: SDD
operation: Freq
keyword: #p
keyword: freq=noraman
keyword: PBEPBE/SDD
title: #p freq=noraman PBEPBE/SDD
converged: YES YES NO NO
title: Mulliken charges:
elementType: S S S S O O O O O O O O N N C C C C C C C C C C C C C C C C C C C C H H H H H H H H H H H H H H H H H H H H H H H H
charge: 0.923038 0.928304 0.094429 0.054398 -0.529283 -0.538905 -0.522055 -0.550491 -0.408158 -0.409653 -0.220938 -0.219991 -0.535458 -0.518513 -0.097763 -0.094159 -0.700622 -0.785055 -0.011356 -0.012718 0.165424 0.238861 -0.239259 -0.248240 -0.252210 -0.211749 0.455934 0.453929 -0.357109 -0.333863 -0.397757 -0.413083 -0.800044 -0.798556 0.337744 0.330711 0.341231 0.327181 0.284009 0.302999 0.298482 0.304859 0.287327 0.283295 0.279639 0.292518 0.305781 0.245620 0.241161 0.246394 0.236035 0.220941 0.243999 0.239357 0.229247 0.239086 0.391318 0.383735
chargesum: 0.00000
title: Mulliken charges with hydrogens summed into heavy atoms:
elementType: S S S S O O O O O O O O N N C C C C C C C C C C C C C C C C C C C C
charge: 0.923038 0.928304 0.094429 0.054398 -0.529283 -0.538905 -0.522055 -0.550491 -0.016840 -0.025918 -0.220938 -0.219991 -0.194227 -0.191332 0.239980 0.236552 -0.113613 -0.181714 -0.011356 -0.012718 0.165424 0.238861 0.048067 0.035055 0.027429 0.080769 0.455934 0.453929 -0.051327 -0.088243 -0.156595 -0.166690 -0.099068 -0.090866
polarizability: 4.72161497e+02 -2.67564959e+01 3.45940375e+02 -9.29006380e+00 -1.06909927e+01 2.48286025e+02
1716.lowfreq: -6.5896 -2.6782 -0.0003 0.0017 0.0024 3.8888 11.1759 12.2101 16.9175
frequency: 10.5841 11.7788 16.8097 23.0023 26.2454 30.4821 31.8160 34.7740 36.7279 39.0898 42.8151 48.0735 56.7679 57.6375 68.3091 76.8479 86.8834 110.9153 113.9891 121.6280 129.8580 135.6611 139.1875 150.8380 162.5687 186.2367 216.1527 223.2046 224.5711 236.8143 237.9064 260.4862 268.3216 273.3784 285.0736 297.1361 305.6388 307.8790 315.0566 322.0667 352.2568 370.8821 380.8066 384.4524 389.8626 405.8401 408.1662 414.4803 418.9081 420.6824 445.2820 467.1476 507.2833 509.2419 513.6094 529.1627 557.1089 561.0340 587.7124 588.4356 596.1799 602.7633 620.3697 621.3720 642.4150 692.8965 707.0929 710.9114 713.9182 724.8806 774.6394 775.4223 786.0219 792.8682 801.5972 807.5844 821.5867 828.7445 829.4713 846.4712 851.1557 867.2088 903.5108 909.5338 924.9834 954.7025 962.4754 963.5255 981.5379 985.9681 986.8135 994.7586 997.1871 1000.7151 1007.6100 1015.0096 1049.9847 1050.1886 1052.2729 1053.5059 1054.2073 1055.7546 1080.2031 1114.8744 1121.2025 1125.6821 1176.6775 1181.9710 1187.3125 1191.7005 1218.6694 1220.6865 1238.5128 1244.2318 1262.0899 1266.2744 1291.9383 1296.6496 1299.7208 1301.1146 1302.5474 1335.2616 1369.3601 1371.0647 1381.1638 1382.9933 1392.4110 1392.8531 1400.1363 1402.0347 1406.3475 1416.8550 1468.2825 1470.1616 1473.5953 1473.9243 1475.8603 1475.8917 1592.7196 1594.8748 1595.9178 1596.6491 1652.7814 1661.2456 2899.7761 2924.3912 2982.4399 2983.2658 3029.1690 3034.4965 3062.6176 3063.8077 3090.3977 3093.1715 3118.9250 3122.7585 3133.8420 3136.7296 3136.8109 3140.4879 3164.7037 3166.7669 3173.6921 3175.3787 3254.4757 3311.2751 3509.1176 3514.8340
redmass: 6.4482 6.4745 6.7779 7.0027 6.1704 4.6338 1.3552 4.9016 4.5828 1.2733 4.7326 5.3983 7.9512 6.5223 4.4918 6.7784 5.9740 7.6332 6.9180 8.4465 6.5382 5.3017 6.0240 6.1029 9.0095 4.1055 4.4029 7.4296 7.7178 7.4600 7.1730 5.0808 5.4631 5.2943 5.1400 5.9265 4.9018 5.7004 6.0980 3.7551 3.9268 5.4075 3.5826 4.5085 6.9366 14.1200 2.8651 3.0506 7.0666 7.1231 5.2985 6.2301 3.1655 3.2042 2.9789 3.7369 2.0292 4.1877 5.6576 5.1241 1.3303 3.4134 6.9487 6.9410 2.1560 5.5641 3.2627 3.3311 4.6743 5.1371 4.7747 5.1874 2.8447 3.4289 7.0142 2.9225 2.9241 1.3676 1.3232 1.2478 1.8813 1.2522 4.3977 2.8185 11.3631 5.9154 1.3123 1.3255 1.3844 2.5889 1.9633 1.9959 2.7270 2.6325 1.3495 2.5086 1.8102 2.1067 2.5610 1.6225 2.4343 2.4198 2.6646 3.3305 1.2909 1.2936 1.2990 1.1877 1.1378 1.1747 3.0535 2.8492 1.1957 1.1957 1.2476 1.3992 1.6366 1.2902 1.2617 1.2640 1.2660 1.1714 1.5473 1.4349 4.8856 4.1705 2.8557 2.7642 1.3696 1.3228 1.0997 1.0943 1.0589 1.0457 2.2410 2.2103 1.1426 1.1170 5.8452 6.2255 6.8211 6.6265 8.9832 9.1398 1.0803 1.0818 1.0374 1.0376 1.0588 1.0599 1.0974 1.0967 1.0997 1.0990 1.1040 1.1049 1.0922 1.0893 1.0895 1.0900 1.0959 1.0957 1.0957 1.0945 1.0733 1.0735 1.0639 1.0642
irintensity: 0.5640 0.6831 0.4506 2.5753 0.5759 0.5385 0.7589 0.2824 1.2347 0.2881 0.5540 0.5834 0.7196 0.4724 0.5780 0.5570 1.4481 2.7040 0.2891 3.1354 3.9286 1.3275 1.9234 1.2185 1.1574 2.0779 3.1604 32.1642 9.7782 2.0464 0.3899 2.2477 1.7118 2.5621 2.8890 16.6416 12.9703 6.7209 3.3335 4.5116 14.3701 1.2734 12.7219 18.0614 19.1293 3.1266 0.2935 1.8577 54.1382 36.6134 59.6340 40.1851 37.9378 25.0727 66.2887 34.3435 75.1296 28.5202 18.4126 27.5992 103.6733 32.5011 1.0496 0.1169 83.2246 8.1755 0.8080 0.1242 48.0619 7.9556 28.6663 20.1961 72.3152 83.9311 106.1338 186.8183 43.9023 38.0235 34.2935 2.0434 53.4574 23.5875 58.9265 26.5571 53.4301 32.4918 1.6349 1.3161 0.8902 4.1606 3.6853 6.4987 6.8716 27.5613 0.5379 94.0137 20.9693 184.7419 115.1491 7.1083 105.5386 11.7802 23.0101 19.0905 9.8310 10.2776 17.3511 10.1644 22.4622 6.8649 7.0231 8.9394 5.5742 6.0026 11.2500 3.9699 57.0108 60.9952 14.1567 1.1231 1.6600 6.0768 45.4217 8.6599 4.0874 2.1080 13.8131 15.7191 14.6854 15.3829 15.0619 11.4187 14.4049 14.2025 12.7814 31.5059 17.1222 21.2461 14.2541 9.5461 0.3914 1.7660 235.1806 253.1673 42.9458 15.7932 22.6370 25.3851 5.0124 3.2700 14.6100 16.2280 23.1293 16.5396 4.5112 2.4540 12.3736 17.6310 11.4611 10.5752 4.4585 3.0092 6.8031 3.7048 70.1099 68.2739 23.6913 35.6860
temp: 298.150 k
press: 1.00000 atm
elementType: 16 16 16 16 8 8 8 8 8 8 8 8 7 7 6 6 6 6 6 6 6 6 6 6 6 6 6 6 6 6 6 6 6 6 1 1 1 1 1 1 1 1 1 1 1 1 1 1 1 1 1 1 1 1 1 1 1 1
symmnumber: 1
zpe: 1096874.9 jmol-1
zpe.correction: 0.417778 hartree
zpe.thermalcorrener: 0.456200 hartree
zpe.thermalcorrenthalpy: 0.457144 hartree
zpe.thermalcorrgfe: 0.338441 hartree
zpe.sumelectzpe: -3077.189366 hartree
zpe.sumelectthermal: -3077.150943 hartree
zpe.sumelectthermalent: -3077.149999 hartree
zpe.sumelectthermalfe: -3077.268703 hartree
dipole: -10.0355 -2.3315 -3.3902
dipole: 10.8462
quadrupole: -200.6907 -211.9416 -233.7064
quadrupole: -22.8160 -13.1660 1.0384
quadrupole: 14.7555 3.5046 -18.2602 -22.8160 -13.1660 1.0384
hfenergy: -3077.6071435 hartree
pointgroup: C01 [X(C20H24N2O8S4)]
dipole: -3.8827768 -0.6417277 -1.649675 debye
polarizability: 464.3161543|-38.1050204|349.507151|14.5572214|-24.7868383|252.5645926 unknown
InChI: InChI=1S/C20H24N2O8S4/c1-13-3-7-15(8-4-13)33(27,28)21-17(19(23)24)11-31-32-12-18(20(25)26)22-34(29,30)16-9-5-14(2)6-10-16/h3-10,17-18,21-23,25H,11-12H2,1-2H3
charge 0 multiplicity 1
58 atoms
S  4.662753 0.519756 1.209118
S  -2.380093 0.419215 -0.159096
S  1.65811 -1.554284 -0.579557
S  0.783932 -1.97991 1.489483
O  6.162423 1.144585 1.316884
O  3.889412 -0.140433 2.49222
O  -1.751107 0.070255 -1.623678
O  -1.763378 1.608211 0.776776
O  4.960206 -4.407855 0.976704
O  -3.840817 -2.713339 -0.948907
O  6.61505 -2.950564 0.242793
O  -3.134851 -4.382245 0.502631
N  4.779341 -0.868285 -0.095074
N  -2.261702 -1.132484 0.943039
C  4.270272 -2.161091 0.399679
C  -1.759474 -2.331422 0.206365
C  3.149008 -2.708453 -0.520779
C  -0.672576 -3.080438 1.00778
C  3.532051 1.804124 0.444668
C  -4.216865 0.736215 -0.359859
C  5.417126 -3.172915 0.520809
C  -2.949041 -3.268978 -0.031085
C  2.159348 1.740869 0.731405
C  -4.87251 1.457999 0.651066
C  4.115314 2.786379 -0.369985
C  -4.845801 0.280988 -1.526888
C  1.855579 3.724176 -0.697351
C  -6.938742 1.28611 -0.687628
C  1.321626 2.714575 0.148371
C  -6.245788 1.72615 0.473612
C  3.254817 3.75274 -0.937651
C  -6.220816 0.569263 -1.680199
C  0.934583 4.745118 -1.339279
C  -8.41613 1.588238 -0.857192
H  3.846687 -2.024775 1.423775
H  -1.348166 -2.027057 -0.783548
H  5.800699 -0.909466 -0.302945
H  -1.544332 -0.816097 1.636303
H  3.49161 -2.751802 -1.569989
H  2.816206 -3.703513 -0.189456
H  -0.296503 -3.937234 0.429335
H  -1.072174 -3.455846 1.966749
H  1.759763 0.969466 1.395084
H  -4.324577 1.81311 1.529255
H  5.196924 2.808356 -0.535472
H  -4.278169 -0.267197 -2.284266
H  0.244552 2.667419 0.347009
H  -6.785507 2.288372 1.244328
H  3.678459 4.535923 -1.576541
H  -6.73915 0.234874 -2.585811
H  0.265327 5.206913 -0.591056
H  1.499946 5.54981 -1.839332
H  0.287062 4.264054 -2.096624
H  -8.609679 2.675647 -0.806668
H  -8.799445 1.221403 -1.823962
H  -9.013604 1.115829 -0.055162
H  5.725296 -5.038812 1.065956
H  -4.636387 -3.30515 -1.042957
