program: Gaussian 09
title: 000258810
version: EM64L-G09RevD.01
frameworkgroup: C1[X(C7H6N2O3)]
method: RPBEPBE
basis: SDD
operation: Freq
keyword: #pfreq=noraman
keyword: PBEPBE/SDD
title: #p freq=noraman PBEPBE/SDD
converged: NO YES NO NO
title: Mulliken charges:
elementType: O O O N N C C C C C C C H H H H H H
charge: -0.400973 -0.257609 -0.216590 -0.064288 -0.615506 0.331478 -0.116947 -0.285354 -0.151565 0.202756 -0.346250 0.081144 0.266832 0.241155 0.251306 0.358705 0.334654 0.387051
chargesum: 0.00000
title: Mulliken charges with hydrogens summed into heavy atoms:
elementType: O O O N N C C C C C C C
charge: -0.013922 -0.257609 -0.216590 -0.064288 0.077853 0.331478 -0.116947 -0.018521 0.089590 0.202756 -0.094944 0.081144
polarizability: 1.23539390e+02 8.14116809e-01 1.13197945e+02 -3.21623104e+00 3.70588731e+00 5.14785685e+01
1716.lowfreq: -4.9481 0.0008 0.0010 0.0011 7.7007 9.6236 33.3114 108.1394 113.7560
frequency: 33.2789 108.1349 113.7544 151.4490 167.8818 227.0188 312.8457 340.7533 372.0672 421.2538 492.5506 550.8263 577.1913 582.2645 586.8358 606.3371 686.9383 692.1956 697.5512 701.5448 810.1518 812.7105 824.4320 947.4798 989.6841 1001.8483 1053.7555 1060.3409 1089.5563 1156.0581 1176.3620 1242.1464 1317.5994 1319.1893 1363.1638 1423.9920 1439.9462 1551.4760 1554.4606 1575.9483 1637.9698 1648.5610 3143.3026 3156.1506 3179.5858 3482.7356 3521.1730 3664.9748
redmass: 7.9152 7.8049 5.3688 6.0367 6.4099 4.5621 8.1180 5.3586 4.3039 3.4434 3.4283 1.6737 3.9119 1.5695 2.6457 5.6369 4.5693 1.2821 2.8452 4.7607 4.1729 2.7871 2.4499 1.3943 1.4176 5.7462 2.6948 2.2280 2.1817 1.5382 2.1286 1.6486 8.9076 2.3834 2.9959 2.1896 3.1821 2.8861 1.8334 6.2449 5.9783 9.4167 1.0889 1.0921 1.1001 1.0473 1.0640 1.1019
irintensity: 1.5987 1.1953 7.6516 12.3782 1.8056 13.8424 5.3641 2.1486 0.8247 6.0387 33.8830 87.2600 21.3344 90.6935 26.3313 18.2834 52.4098 31.2581 184.4846 27.8701 11.0485 10.2648 37.3632 1.7194 7.2624 174.1734 20.2098 28.9773 53.9698 12.7508 20.9005 0.8140 18.9847 63.5796 119.6477 5.7032 12.2079 80.7272 95.9022 22.9010 369.6583 160.9756 8.4723 6.6808 16.1848 54.5443 38.2718 77.2231
temp: 298.150 k
press: 1.00000 atm
elementType: 8 8 8 7 7 6 6 6 6 6 6 6 1 1 1 1 1 1
symmnumber: 1
zpe: 332367.0 jmol-1
zpe.correction: 0.126592 hartree
zpe.thermalcorrener: 0.136983 hartree
zpe.thermalcorrenthalpy: 0.137927 hartree
zpe.thermalcorrgfe: 0.089871 hartree
zpe.sumelectzpe: -604.680423 hartree
zpe.sumelectthermal: -604.670032 hartree
zpe.sumelectthermalent: -604.669088 hartree
zpe.sumelectthermalfe: -604.717144 hartree
dipole: -4.0060 -0.4154 1.6785
dipole: 4.3633
quadrupole: -62.5344 -54.2834 -74.4945
quadrupole: 0.8697 6.2526 -1.8120
quadrupole: 1.2363 9.4874 -10.7237 0.8697 6.2526 -1.8120
hfenergy: -604.8070149 hartree
pointgroup: C01 [X(C7H6N2O3)]
dipole: -1.5911276 0.0726067 0.6402215 debye
dipolederiv: -0.5240871 0.0259761 -0.4336164 0.0417826 -0.4726836 0.0243818 -0.4722479 0.1114064 -1.0241549 -0.9234144 0.1533181 0.0868617 -0.0237913 -0.7945994 0.0019218 0.0615906 -0.0302752 -0.3365443 -0.7231386 0.262901 0.2128908 0.2123059 -0.5538562 -0.2442147 -0.0076024 -0.1863755 -0.8081624 -0.4250397 0.0466382 0.0123208 0.0091135 -0.4133898 -0.0006032 0.0087727 0.0107019 -0.2090185 -0.4743299 0.1736844 -0.0122555 0.3070867 -1.1864708 -0.0796286 -0.0048274 -0.0752197 -0.6598278 -0.1898349 0.041737 -0.0236815 -0.0782576 -0.2001878 -0.0158934 0.0184678 -0.0135664 -0.0187966 0.035146 -0.2283918 0.0046382 0.0376541 0.1067073 -0.0156897 -0.0270625 0.0224996 0.063438 0.0567192 -0.0002124 0.0042628 0.0309825 0.1938181 0.0130454 0.0158392 0.0188525 -0.0973772 -0.1207159 0.0682498 0.0114384 0.2039461 -0.0280405 0.0048644 0.0120377 -0.009916 -0.0906155 1.1190467 -0.2361959 -0.1330111 -0.1463267 1.4915779 0.0902366 -0.0965743 0.0733449 0.2398387 0.3564464 -0.0280135 -0.0146694 -0.2356988 0.065982 0.0110421 -0.0371972 -0.002139 -0.0640637 1.2587493 -0.362443 0.1703341 -0.3767851 0.776751 0.2706203 0.3556631 0.1308317 1.5142469 0.0907097 0.0533454 0.0032129 0.0224512 -0.0235866 -0.0033929 -0.004521 -0.0056786 0.1409583 -0.0062681 -0.0827132 -0.0038067 -0.1010749 0.0175279 -0.0048058 0.0011107 -0.0074979 0.1627118 -0.1043742 0.0149974 0.0073275 0.0470908 0.0753505 -0.0034639 0.0056887 0.0019728 0.1386046 0.2460794 0.0508025 0.0151534 0.040002 0.3444767 -0.0000144 0.0123862 0.0160601 0.3637474 0.1645748 0.0026506 0.0264946 -0.0242847 0.2391121 0.0003809 0.0268127 0.0063546 0.3809257 0.1637316 0.0436694 0.0661055 0.0338038 0.3615114 -0.0487867 0.1316635 -0.0613562 0.3040896 unknown
polarizability: 123.5988714|-0.8303055|113.0755449|-1.6563786|4.9562589|51.5414876 unknown
InChI: InChI=1S/C7H6N2O3/c8-6(10)5-4(7(11)12)2-1-3-9-5/h1-3,11H,8H2
charge 0 multiplicity 1
18 atoms
O  2.038679 -1.042172 1.238378
O  1.850167 1.472369 -0.233647
O  2.066412 -1.679307 -1.004532
N  -1.718591 0.952803 0.04692
N  0.064978 2.96117 0.066466
C  0.023212 -0.764858 -0.017929
C  -0.400903 0.588682 0.009764
C  -0.972479 -1.7696 -0.065933
C  -2.333414 -1.398878 -0.041807
C  0.61554 1.711056 -0.05782
C  -2.663231 -0.025624 0.031674
C  1.474029 -1.16479 -0.032438
H  -0.680722 -2.823208 -0.115906
H  -3.12423 -2.153599 -0.074193
H  -3.706273 0.305339 0.073138
H  -0.951334 3.029379 0.165218
H  0.659935 3.785268 0.012643
H  3.013022 -1.238728 1.184602
