program: Gaussian 09
title: 000258816
version: EM64L-G09RevD.01
frameworkgroup: C1[X(C14H10Br2N2O2)]
method: RPBEPBE
basis: SDD
operation: Freq
keyword: #p
keyword: freq=noraman
keyword: PBEPBE/SDD
title: #p freq=noraman PBEPBE/SDD
converged: YES YES NO NO
title: Mulliken charges:
elementType: Br Br O O N N C C C C C C C C C C C C C C H H H H H H H H H H
charge: 0.040255 0.040340 -0.318681 -0.318665 -0.313165 -0.313122 0.321245 0.321325 0.213041 0.213015 -0.360370 -0.360392 -0.307887 -0.307911 -0.179207 -0.179238 -0.229588 -0.229573 -0.224010 -0.224011 0.292759 0.292746 0.329671 0.329556 0.252876 0.252873 0.240798 0.240798 0.242261 0.242262
chargesum: 0.00000
title: Mulliken charges with hydrogens summed into heavy atoms:
elementType: Br Br O O N N C C C C C C C C C C C C C C
charge: 0.040255 0.040340 -0.318681 -0.318665 0.016507 0.016434 0.321245 0.321325 0.213041 0.213015 -0.360370 -0.360392 -0.015128 -0.015166 0.073669 0.073635 0.011210 0.011225 0.018250 0.018251
polarizability: 3.44893917e+02 4.67238179e+01 2.54496687e+02 -6.38266862e-03 1.03960828e-02 7.28636790e+01
1716.lowfreq: -3.4596 -0.0007 -0.0006 -0.0003 1.1402 5.2456 9.6889 23.6292 30.4939
frequency: 9.6884 23.6072 30.4939 40.7602 84.4127 98.1115 102.4334 121.4406 169.7668 176.3590 189.0223 221.1273 239.3177 269.6350 298.3094 306.1098 319.1140 373.2118 413.9840 437.0089 446.4488 474.7859 490.0314 497.9776 528.0564 628.7730 633.4645 643.4525 660.9155 677.7484 685.3591 690.2335 695.2240 737.0755 743.5973 777.8618 780.0734 805.8812 886.6279 886.8287 923.9112 975.8406 975.8591 995.5741 996.6865 1009.7277 1009.7677 1032.0055 1037.1802 1074.0818 1110.9736 1114.1799 1120.3602 1174.3345 1174.5787 1204.8868 1229.8727 1249.8804 1262.7108 1264.7094 1360.1918 1362.5512 1405.4302 1414.3569 1422.4051 1449.8132 1456.7354 1507.1148 1516.3415 1548.4240 1567.7574 1576.7324 1598.4599 1599.0118 3141.5153 3141.5966 3154.0752 3154.0808 3166.0628 3166.1079 3177.5965 3177.6537 3397.2263 3407.5498
redmass: 10.7315 10.0764 6.5575 8.9054 29.8014 7.4491 4.4264 5.4164 10.9047 5.5301 15.8203 5.6423 6.7141 8.4816 9.8885 5.6224 7.5035 9.4590 8.0936 3.4818 3.5578 7.0199 4.2608 4.4091 6.3820 6.6761 6.5332 2.0424 5.0765 7.3272 1.0700 7.5319 1.8927 3.1680 2.3086 1.4311 1.5356 7.9053 1.3723 1.3749 6.7460 1.3624 1.3622 7.5347 6.7261 1.3463 1.3465 3.1341 2.8208 2.3734 1.9145 1.8128 2.0142 1.0584 1.0582 3.1347 1.4627 2.4048 1.4518 1.5469 8.0937 7.7421 2.1271 2.2464 3.0492 2.3358 2.7233 9.5901 2.1956 7.8239 6.5137 7.2535 6.5908 6.5018 1.0861 1.0861 1.0902 1.0902 1.0950 1.0950 1.1004 1.1005 1.0838 1.0798
irintensity: 0.4903 0.0000 2.2468 1.7108 0.0001 6.2019 0.0000 5.6738 0.0000 0.0001 5.8465 0.6140 0.0000 2.4701 0.0000 0.0019 78.1824 0.0000 7.5394 5.2478 0.0000 0.0003 14.4145 0.0001 28.1963 0.0000 11.4642 0.0002 36.9595 14.8981 193.9062 0.0054 0.0005 42.4920 0.0001 116.4145 0.0001 5.3173 2.0347 0.0013 0.0000 0.3364 3.8801 76.1693 0.0002 2.7802 0.0765 0.0001 22.0195 0.0000 11.5030 0.0001 14.5450 9.1866 0.0019 0.0000 29.2324 0.0001 17.8999 0.0000 1.1062 0.0000 390.7802 0.0001 548.2703 0.0000 83.5624 416.5896 0.0001 0.0000 105.7143 0.0001 22.9173 0.0016 0.1154 6.5225 0.1373 6.5817 0.3019 13.0709 43.3357 0.4103 0.0194 281.1114
temp: 298.150 k
press: 1.00000 atm
elementType: 35 35 8 8 7 7 6 6 6 6 6 6 6 6 6 6 6 6 6 6 1 1 1 1 1 1 1 1 1 1
symmnumber: 1
zpe: 550881.8 jmol-1
zpe.correction: 0.209820 hartree
zpe.thermalcorrener: 0.227916 hartree
zpe.thermalcorrenthalpy: 0.228860 hartree
zpe.thermalcorrgfe: 0.158840 hartree
zpe.sumelectzpe: -824.957442 hartree
zpe.sumelectthermal: -824.939346 hartree
zpe.sumelectthermalent: -824.938401 hartree
zpe.sumelectthermalfe: -825.008421 hartree
dipole: 0.0009 -0.0010 0.0006
dipole: 0.0015
quadrupole: -84.8022 -134.2937 -140.0462
quadrupole: 10.1104 -0.0023 -0.0025
quadrupole: 34.9118 -14.5797 -20.3321 10.1104 -0.0023 -0.0025
hfenergy: -825.1672614 hartree
pointgroup: C01 [X(C14H10Br2N2O2)]
dipole: 0.0001956 0.0002475 0.0004834 debye
polarizability: 363.9234263|0.0544437|72.8648738|-10.0388601|0.4367203|235.4659821 unknown
InChI: InChI=1S/C14H10Br2N2O2/c15-11-7-3-1-5-9(11)13(19)17-18-14(20)10-6-2-4-8-12(10)16/h1-8,17-18H
charge 0 multiplicity 1
30 atoms
Br -2.333492 0.27418 -2.946065
Br 2.331839 0.292006 2.944803
O  -1.527252 0.291246 1.813638
O  1.526782 0.282608 -1.814757
N  -0.633137 0.285228 -0.293014
N  0.632548 0.287175 0.291885
C  -3.118568 0.285338 -0.030604
C  3.117913 0.28741 0.029701
C  -1.723958 0.287438 0.547486
C  1.723395 0.285557 -0.548587
C  -3.552438 0.280194 -1.386454
C  3.551387 0.290009 1.385662
C  -4.140585 0.288994 0.965707
C  4.140201 0.286096 -0.96634
C  -4.923007 0.278854 -1.727506
C  4.921851 0.291221 1.727133
C  -5.507414 0.287843 0.641935
C  5.506938 0.287349 -0.642164
C  -5.904457 0.282715 -0.713989
C  5.903592 0.289905 0.713887
H  -3.796792 0.29283 2.005197
H  3.796702 0.284028 -2.005931
H  -0.628893 0.282424 -1.322548
H  0.628301 0.289903 1.32142
H  -5.219119 0.274769 -2.780285
H  5.217652 0.293158 2.780005
H  -6.256863 0.290894 1.439595
H  6.256619 0.286311 -1.439612
H  -6.964148 0.281651 -0.989662
H  6.963204 0.290864 0.989866
