program: Gaussian 09
title: 000258805
version: EM64L-G09RevD.01
frameworkgroup: C1[X(C6H7N5O)]
method: RPBEPBE
basis: SDD
operation: Freq
keyword: #pfreq=noraman
keyword: PBEPBE/SDD
title: #p freq=noraman PBEPBE/SDD
converged: NO YES NO NO
title: Mulliken charges:
elementType: O N N N N N C C C C C C H H H H H H H
charge: -0.241191 -0.147885 -0.308008 -0.137609 -0.028064 -0.077664 0.246055 0.433142 0.205439 -0.422993 -0.601721 -0.739504 0.265510 0.257391 0.257387 0.274651 0.239569 0.262747 0.262748
chargesum: 0.00000
title: Mulliken charges with hydrogens summed into heavy atoms:
elementType: O N N N N N C C C C C C
charge: -0.241191 -0.147885 -0.308008 -0.137609 -0.028064 -0.077664 0.246055 0.433142 0.205439 -0.157484 0.187709 0.025560
polarizability: 1.34598812e+02 7.56787776e+00 1.17014371e+02 2.07468001e-04 -9.00938112e-04 5.02221585e+01
1716.lowfreq: -2.0015 -0.0006 -0.0004 -0.0002 6.0083 9.9800 91.8946 100.5269 140.0307
frequency: 91.8843 100.5014 140.0300 158.6535 187.6407 232.2794 254.0498 278.8749 356.6632 362.3408 422.7790 505.5138 549.8370 578.0948 609.3750 640.6379 678.9566 692.0100 732.0549 855.1211 873.3293 893.3554 940.2280 994.5835 1029.2479 1052.0757 1082.0072 1111.1690 1130.8579 1147.0742 1186.2238 1214.9743 1243.9147 1323.0621 1409.2785 1414.3330 1438.0776 1452.2619 1463.1228 1477.6746 1477.8180 1545.8496 1603.3774 1655.5644 3000.0351 3011.3090 3079.3458 3106.2932 3127.7288 3138.3164 3202.1873
redmass: 4.5958 1.0218 1.3924 2.4220 6.4590 3.8034 3.5786 2.9259 7.2742 7.2946 6.6654 8.2415 4.2450 5.7904 5.7956 13.0688 4.5255 4.9000 8.4835 1.4253 5.3832 5.5061 5.7774 3.5070 2.4248 1.5270 5.2160 8.9360 1.3066 5.5803 2.2597 4.2903 1.9926 4.7426 1.2686 1.2568 2.7105 1.0422 1.2447 1.0414 1.1772 6.1261 8.8422 7.9902 1.0377 1.0326 1.0969 1.1028 1.1003 1.1023 1.0934
irintensity: 14.0685 0.0573 0.0004 0.2590 0.1151 0.6461 1.3149 4.7446 0.7439 11.8932 0.7241 5.6394 5.5871 10.5950 5.9359 0.2757 0.0201 4.6605 3.2014 28.9775 37.4978 5.2962 10.1526 10.0300 33.6610 8.8162 7.8466 1.8650 0.3683 10.7946 26.5336 17.6299 7.0775 24.4005 42.0481 4.8742 182.6054 18.0047 6.5534 20.5943 55.3785 111.3708 64.2971 399.2431 2.2743 17.9326 4.1221 11.7251 11.4258 0.8470 1.3876
temp: 298.150 k
press: 1.00000 atm
elementType: 8 7 7 7 7 7 6 6 6 6 6 6 1 1 1 1 1 1 1
symmnumber: 1
zpe: 360386.8 jmol-1
zpe.correction: 0.137264 hartree
zpe.thermalcorrener: 0.147623 hartree
zpe.thermalcorrenthalpy: 0.148568 hartree
zpe.thermalcorrgfe: 0.101404 hartree
zpe.sumelectzpe: -580.903804 hartree
zpe.sumelectthermal: -580.893445 hartree
zpe.sumelectthermalent: -580.892500 hartree
zpe.sumelectthermalfe: -580.939664 hartree
dipole: 0.0023 3.3406 -0.0001
dipole: 3.3406
quadrupole: -79.9638 -73.1009 -68.3648
quadrupole: -18.7912 0.0002 -0.0002
quadrupole: -6.1539 0.7090 5.4450 -18.7912 0.0002 -0.0002
hfenergy: -581.0410682 hartree
pointgroup: C01 [X(C6H7N5O1)]
dipole: -0.3996126 1.2520812 0.0000256 debye
dipolederiv: -1.3439831 0.1593063 0.0000419 -0.0493459 -0.47282 -0.0000052 -0.0000569 0.0000128 -0.3544813 -1.0548091 0.0638784 -0.0000027 0.3948294 -0.6507126 -0.0000179 0.0000303 -0.0000039 -0.1528024 -0.5363049 0.1924698 -0.0000051 0.297508 -0.8465142 0.0000115 -0.0000123 -0.0000433 0.0611523 -0.7818597 -0.1685372 -0.0000025 0.281981 -0.2034041 0.0000309 -0.0000193 -0.0000046 -0.1809328 0.2589462 -0.3073748 -0.000067 -0.4089774 -0.1747314 -0.0000296 0.0000381 0.000062 -0.0894442 0.2555361 0.2238819 0.0000796 0.3970285 0.0350267 -0.0000427 -0.0000066 -0.000024 -0.1850321 0.9427908 0.1060715 -0.0000061 -0.4059904 0.3069459 0.0000166 -0.0000024 -0.0000241 0.1808442 0.7276963 0.0625683 -0.000012 -0.1789854 0.8335944 0.0000075 -0.0000161 0.0000137 0.0654548 1.7032418 -0.3040851 -0.0000362 -0.1124555 0.9180237 0.000024 0.0000192 0.0000086 0.2369449 -0.621198 -0.1713832 0. -0.3420194 -0.2520261 -0.0000007 0.0000354 -0.0000049 -0.1902291 0.1483197 0.22778 0.0000207 0.1683921 0.299417 0.000017 0.0000241 0.0000145 0.1917932 -0.1551244 -0.222848 -0.0000008 -0.086185 -0.1010391 0.0000058 0.0000011 0.0000141 0.032198 0.0851195 0.0334838 0.0000008 0.0030422 0.005114 -0.0000029 -0.000006 0.0000004 0.1674277 0.1049159 0.0189794 -0.0729521 -0.0362415 0.0113164 0.0504316 -0.0258688 0.0779936 -0.0257569 0.1049261 0.0189299 0.0729176 -0.0362688 0.0113266 -0.0504189 0.0258232 -0.078002 -0.0258353 0.0012161 -0.0444222 0.0000245 0.0950552 0.1549641 -0.0000221 0.0000168 -0.0000108 0.1342458 0.030667 0.1364152 0.0000059 0.0427828 -0.0432472 -0.0000052 0.0000036 -0.0000066 0.1241449 0.0649583 -0.0125591 0.077955 -0.012078 0.0843823 -0.0371862 0.086181 -0.0047683 0.0051455 0.0649454 -0.012555 -0.0779614 -0.012072 0.0843836 0.0371866 -0.0861843 0.0047727 0.0051627 unknown
polarizability: 137.3558739|-1.0908629|114.2573083|-0.0000757|0.0009214|50.2221585 unknown
InChI: InChI=1S/C6H7N5O/c1-4-3-5(12)10(2)6-7-8-9-11(4)6/h3H,1-2H3
charge 0 multiplicity 1
19 atoms
O  -3.104508 0.404669 0.000011
N  -1.114626 -0.853626 0.000017
N  0.968605 0.326179 0.00002
N  1.121812 -1.913033 -0.000048
N  2.363515 0.018555 -0.000106
N  2.412318 -1.325743 0.000081
C  0.25635 -0.861341 -0.000005
C  0.374582 1.597398 0.000058
C  -1.842246 0.400136 0.0001
C  -1.002884 1.611064 0.000081
C  -1.848204 -2.138007 -0.000038
C  1.286694 2.789713 0.000034
H  -1.543502 2.55895 0.000076
H  -1.585025 -2.723421 0.896334
H  -1.585307 -2.723195 -0.896643
H  -2.921467 -1.896874 0.000151
H  0.700508 3.720712 0.000072
H  1.947002 2.775894 -0.885611
H  1.947084 2.77587 0.885616
