program: Gaussian 09
title: 000258841
version: EM64L-G09RevD.01
frameworkgroup: C1[X(C13H12N4O3S)]
method: RPBEPBE
basis: SDD
operation: Freq
keyword: #p
keyword: freq=noraman
keyword: PBEPBE/SDD
title: #p freq=noraman PBEPBE/SDD
converged: YES YES NO NO
title: Mulliken charges:
elementType: S O O O N N N N C C C C C C C C C C C C C H H H H H H H H H H H H
charge: 0.246618 -0.248843 -0.343512 -0.304027 -0.118113 -0.036486 -0.347061 -0.167710 0.108007 -0.621039 0.052262 -0.181960 0.497473 0.214115 0.208307 -0.384786 -0.382264 -0.229865 -0.231496 -0.232004 -0.800038 0.278000 0.243821 0.360080 0.290048 0.233742 0.231414 0.227389 0.230937 0.293945 0.282504 0.245113 0.385429
chargesum: 0.00000
title: Mulliken charges with hydrogens summed into heavy atoms:
elementType: S O O O N N N N C C C C C C C C C C C C C
charge: 0.246618 -0.248843 0.041917 -0.304027 -0.118113 -0.036486 0.013019 -0.167710 0.108007 -0.099218 0.052262 -0.181960 0.497473 0.214115 0.208307 -0.094738 -0.148522 0.001549 -0.004107 -0.001067 0.021524
polarizability: 2.50574371e+02 -2.67392414e+01 2.30073540e+02 -3.87216520e+00 -5.65120068e+00 1.15538836e+02
1716.lowfreq: -5.5688 -3.6062 -0.0014 -0.0012 0.0020 5.4981 23.2367 31.9398 43.0994
frequency: 22.5994 31.8767 43.0889 59.2201 70.8791 99.8936 116.0457 127.6567 128.6664 167.7896 192.2298 208.0800 226.3316 267.0369 282.0869 312.5833 339.1900 351.3977 358.8076 367.3317 404.4996 420.9649 448.3385 475.5593 493.7346 531.1474 574.9119 597.4729 617.6683 619.7733 631.3328 653.8853 663.3527 681.4943 688.0853 700.3908 711.1452 726.2033 769.6463 800.7534 818.3572 862.0465 904.5501 939.1037 977.3963 984.6008 987.8408 990.0677 1003.9102 1007.8407 1028.1981 1070.2386 1080.3642 1091.2815 1130.0086 1174.6857 1194.0507 1194.9447 1213.1623 1244.3816 1260.0105 1312.0798 1327.1072 1332.9427 1345.3752 1357.2311 1381.4317 1393.2245 1410.1644 1435.3049 1440.8485 1446.4266 1452.6947 1467.9850 1486.6223 1506.8853 1554.6313 1595.3528 1614.0580 1621.8744 1660.6568 3020.5816 3030.9268 3093.4847 3121.8739 3128.2530 3137.9861 3149.4367 3158.6478 3165.0037 3167.3323 3241.6939 3570.2076
redmass: 4.9659 4.1669 4.5911 5.4364 6.2625 8.1570 1.2137 5.2448 5.6256 4.8422 5.8151 10.8753 4.9543 6.9099 11.8211 7.4174 9.7765 3.4803 4.9731 6.0866 2.8413 5.2290 1.1399 4.8185 9.3832 6.0539 5.4169 1.2436 6.2727 9.2973 9.3692 7.8727 8.9906 5.0528 5.1795 5.5728 1.6369 9.4435 3.0581 6.3646 3.3076 1.2525 3.6177 1.4628 2.2406 1.1890 1.4149 5.0655 1.2834 1.3211 2.2869 5.4112 7.4236 1.5852 9.0571 1.0568 1.1859 2.1038 2.6319 3.9857 3.2140 4.5581 2.1491 1.5549 1.5125 1.6791 4.3357 2.2825 3.1970 1.0529 1.5475 2.1063 1.0589 1.2242 2.0701 4.4837 10.0706 6.0730 5.9935 7.8651 7.3826 1.0621 1.0276 1.1025 1.0862 1.0878 1.0924 1.0963 1.1050 1.1016 1.1064 1.0643 1.0784
irintensity: 0.1092 2.6971 0.2837 0.6282 0.9414 2.0218 0.2228 0.0771 0.6206 4.4169 0.9350 2.5879 6.1448 2.4842 0.2761 11.8294 1.1002 15.1098 14.1644 2.0391 0.0206 3.1081 135.9734 0.9060 1.2698 38.2359 2.9710 70.2796 0.1000 4.2659 7.1615 7.4873 12.7399 63.4775 26.2650 15.7408 92.3161 7.9439 18.8529 14.2139 5.8046 0.7700 79.7023 4.7084 15.4872 6.6516 1.1193 0.8003 8.0686 1.8867 7.8364 30.0430 47.4164 12.4093 35.7792 0.0726 4.2385 12.6159 18.5824 62.1704 41.8966 102.8199 86.9238 58.3125 30.8151 102.0871 4.7117 34.2570 1.9754 15.3247 218.0841 0.9125 47.9786 42.6496 32.1396 99.5214 14.6525 6.0569 30.0864 711.6963 288.4078 16.5359 19.2993 0.3984 4.2862 5.9433 8.4322 21.8990 5.6750 31.1237 6.4676 84.8005 104.5856
temp: 298.150 k
press: 1.00000 atm
elementType: 16 8 8 8 7 7 7 7 6 6 6 6 6 6 6 6 6 6 6 6 6 1 1 1 1 1 1 1 1 1 1 1 1
symmnumber: 1
zpe: 629645.6 jmol-1
zpe.correction: 0.239819 hartree
zpe.thermalcorrener: 0.258795 hartree
zpe.thermalcorrenthalpy: 0.259740 hartree
zpe.thermalcorrgfe: 0.190724 hartree
zpe.sumelectzpe: -1343.804257 hartree
zpe.sumelectthermal: -1343.785281 hartree
zpe.sumelectthermalent: -1343.784337 hartree
zpe.sumelectthermalfe: -1343.853353 hartree
dipole: -3.5046 4.6594 -0.9684
dipole: 5.9101
quadrupole: -131.8070 -119.4400 -130.2834
quadrupole: 3.9163 1.2537 5.9358
quadrupole: -4.6302 7.7368 -3.1066 3.9163 1.2537 5.9358
hfenergy: -1344.0440768 hartree
pointgroup: C01 [X(C13H12N4O3S1)]
dipole: 1.1067 -2.0121249 -0.3650041 debye
polarizability: 242.6032503|-28.5385282|238.0436256|5.4134522|4.2621975|115.5398712 unknown
InChI: InChI=1S/C13H12N4O3S/c1-21-13-15-10-9(11(18)17(20)12(19)14-10)16(13)7-8-5-3-2-4-6-8/h2-6,14,20H,7H2,1H3
charge 0 multiplicity 1
33 atoms
S  1.577537 -3.185612 0.353633
O  -0.908398 2.137795 1.28286
O  -3.445509 2.566523 0.294336
O  -4.727738 0.674611 -1.028421
N  0.277657 -0.726224 0.682739
N  -0.948797 -2.283372 -0.47317
N  -2.944271 -0.867566 -0.833932
N  -2.789219 1.309759 0.088437
C  -0.948193 -0.117963 0.343813
C  1.412247 -0.084069 1.408651
C  -1.662537 -1.107247 -0.354237
C  0.226335 -2.014238 0.16462
C  2.418509 0.598959 0.486461
C  -1.464645 1.200069 0.646665
C  -3.560923 0.363117 -0.628837
C  2.191176 1.930616 0.053019
C  3.589034 -0.079652 0.064244
C  3.117831 2.565701 -0.803132
C  4.515626 0.557193 -0.791834
C  4.280154 1.880909 -1.229464
C  0.696368 -4.730974 -0.270714
H  0.960028 0.650218 2.094865
H  1.896303 -0.87942 2.004289
H  -3.463513 -1.583308 -1.34512
H  1.295311 2.461321 0.396526
H  3.778337 -1.104888 0.404748
H  2.936801 3.595177 -1.131489
H  5.418452 0.025426 -1.112191
H  4.999248 2.376834 -1.891158
H  0.354169 -4.557963 -1.299379
H  -0.156554 -4.957304 0.383305
H  1.452577 -5.52942 -0.230126
H  -4.334702 2.405688 -0.165208
