program: Gaussian 09
title: 000258820
version: EM64L-G09RevD.01
frameworkgroup: C1[X(C15H18O4)]
method: RPBEPBE
basis: SDD
operation: Freq
keyword: #pfreq=noraman
keyword: PBEPBE/SDD
title: #p freq=noraman PBEPBE/SDD
converged: YES YES NO NO
title: Mulliken charges:
elementType: O O O O C C C C C C C C C C C C C C C H H H H H H H H H H H H H H H H H H
charge: -0.252557 -0.256361 -0.250414 -0.255158 0.016410 -0.351490 -0.565342 0.529194 0.209280 0.255436 -0.394683 -0.419994 -0.250760 -0.236510 -0.260979 -0.257354 -0.244120 -0.662493 -0.668379 0.294162 0.269232 0.276739 0.245054 0.236766 0.228470 0.226409 0.221408 0.233111 0.234822 0.224409 0.229184 0.230807 0.255405 0.211611 0.250138 0.230140 0.218407
chargesum: 0.00000
title: Mulliken charges with hydrogens summed into heavy atoms:
elementType: O O O O C C C C C C C C C C C C C C C
charge: -0.252557 -0.256361 -0.250414 -0.255158 0.016410 -0.057327 -0.019371 0.529194 0.209280 0.255436 -0.149629 -0.183228 -0.022290 -0.010100 0.193540 0.201876 -0.014935 0.035330 0.030306
polarizability: 2.21128588e+02 -6.13749735e+00 1.44122391e+02 2.97886016e+00 5.97258291e+00 1.48406147e+02
1716.lowfreq: -10.1560 -4.1188 0.0006 0.0010 0.0010 8.8038 19.8289 25.7725 35.7801
frequency: 19.5291 25.6347 35.7485 41.6215 46.3959 68.7991 79.2101 89.5596 93.2224 134.4883 160.5886 186.6337 205.7158 217.6303 238.6861 288.6888 307.4094 323.4203 351.2044 389.0885 403.6336 404.0738 425.9209 448.0921 490.3576 533.6566 573.0243 616.1495 655.0982 693.6311 698.6169 706.2767 744.6897 760.6277 778.4410 791.3943 805.0740 816.7304 820.4140 841.9014 849.2845 910.8865 919.6538 954.4630 974.7897 984.6177 990.7000 994.8183 1009.5004 1019.4210 1032.0586 1059.9046 1087.2064 1093.8895 1096.7461 1097.9669 1114.2968 1149.8087 1156.3999 1158.9335 1173.4807 1196.4741 1223.6369 1257.6049 1275.9086 1276.0810 1305.6105 1327.9059 1353.8196 1357.7975 1374.0658 1390.7175 1392.8318 1395.2375 1441.1825 1454.6087 1456.2737 1458.7637 1461.1809 1463.4234 1482.4090 1485.2439 1492.7924 1589.3663 1609.7730 1615.9412 1623.6384 2992.7920 2993.1470 3028.8865 3031.4702 3088.3394 3088.4654 3093.7731 3095.0755 3110.0450 3118.0812 3119.2153 3120.6821 3121.1164 3127.5696 3140.5316 3152.6428 3165.2730 3216.3357
redmass: 3.9916 3.1313 2.7664 3.7339 4.0103 4.1214 5.1161 4.7284 6.3879 4.1931 2.3507 4.5395 1.4035 2.1387 1.8108 3.0258 2.6471 3.3972 4.5800 4.9680 3.4833 3.0217 6.3039 3.6421 4.3363 3.2918 4.0147 6.4026 5.0428 4.9130 3.4384 2.0080 2.7915 3.4065 2.0343 3.0103 1.5804 1.9251 2.0222 4.6565 1.2666 1.8666 1.4561 2.0841 1.4068 2.1485 5.4805 1.3428 2.5417 3.2833 2.2897 1.8723 1.7987 1.4781 2.1161 2.1015 1.6833 2.4476 1.7019 2.0627 1.0594 1.1256 2.0830 3.1780 1.1250 1.1224 2.4892 1.4767 1.3083 1.4216 3.6502 1.2352 1.2350 2.4718 1.7179 1.1435 1.1058 1.3379 1.0457 1.0429 1.0536 1.0513 2.4107 5.9252 9.8629 6.0214 9.3563 1.0364 1.0361 1.0593 1.0596 1.0973 1.0972 1.1035 1.1031 1.0564 1.0882 1.1057 1.0870 1.1060 1.0873 1.0925 1.0954 1.1010 1.1158
irintensity: 0.8165 0.1829 0.7009 0.6826 0.6195 0.6364 1.3622 2.3273 0.3590 0.5008 2.1494 1.4313 2.6141 2.8097 1.3415 2.4790 13.9425 19.8818 4.4279 7.4135 2.7928 2.1630 0.6070 2.1501 5.7488 18.0297 1.8094 0.1616 18.5272 7.1772 9.6211 74.9404 2.1046 2.5491 27.0181 15.7328 8.5370 6.8031 0.7409 2.8238 0.4137 4.2680 2.0225 1.4356 1.0191 33.7845 0.1395 0.6196 49.7591 24.9698 4.5144 117.6489 74.1273 17.8349 19.5061 21.9808 75.0131 141.7480 24.8947 137.2908 3.9051 0.9688 107.9415 267.5784 5.1012 6.6778 81.5194 13.3839 5.4967 8.9327 9.8585 26.5669 16.6359 6.7638 3.4158 11.3206 27.5056 20.6446 17.5520 15.4420 20.4281 14.0661 11.9329 8.3715 255.9751 10.5643 49.9844 20.5615 17.7153 30.5781 29.8401 34.9474 37.8171 0.6621 0.6623 5.8841 2.7509 28.1954 2.3583 30.2742 0.4983 23.9295 31.0200 16.2429 1.3955
temp: 298.150 k
press: 1.00000 atm
elementType: 8 8 8 8 6 6 6 6 6 6 6 6 6 6 6 6 6 6 6 1 1 1 1 1 1 1 1 1 1 1 1 1 1 1 1 1 1
symmnumber: 1
zpe: 781793.3 jmol-1
zpe.correction: 0.297769 hartree
zpe.thermalcorrener: 0.317346 hartree
zpe.thermalcorrenthalpy: 0.318290 hartree
zpe.thermalcorrgfe: 0.246590 hartree
zpe.sumelectzpe: -881.855007 hartree
zpe.sumelectthermal: -881.835430 hartree
zpe.sumelectthermalent: -881.834486 hartree
zpe.sumelectthermalfe: -881.906186 hartree
dipole: 0.3830 1.5647 -1.1736
dipole: 1.9931
quadrupole: -93.9527 -110.3533 -111.3227
quadrupole: 0.7705 0.9343 -5.3142
quadrupole: 11.2569 -5.1438 -6.1132 0.7705 0.9343 -5.3142
hfenergy: -882.1527761 hartree
pointgroup: C01 [X(C15H18O4)]
dipole: 0.2457401 -0.7040524 0.2425091 debye
polarizability: 218.2204832|15.5357393|143.5562914|-5.7345289|2.5701872|151.8803524 unknown
InChI: InChI=1S/C15H18O4/c1-3-18-13(16)15(14(17)19-4-2)10-12(15)11-8-6-5-7-9-11/h5-9,12H,3-4,10H2,1-2H3
charge 0 multiplicity 1
37 atoms
O  0.736135 -1.747643 -0.089217
O  3.155426 -0.169173 -0.118667
O  0.082027 -0.862358 -2.146738
O  2.505886 1.700425 1.118094
C  0.905217 0.609883 -0.365443
C  -0.286694 1.435834 0.280191
C  0.33228 1.88039 -1.029933
C  -1.661339 0.859124 0.42668
C  0.552557 -0.710912 -0.992812
C  2.233807 0.776124 0.310746
C  -2.488453 0.522535 -0.677163
C  -2.165283 0.652034 1.739398
C  -3.781192 -0.007764 -0.470861
C  -3.457206 0.123982 1.946602
C  0.383701 -3.12213 -0.565539
C  4.536181 -0.063096 0.452265
C  -4.272316 -0.209415 0.839571
C  -1.095773 -3.415209 -0.302237
C  5.382337 0.920968 -0.359627
H  0.073514 1.979543 1.161855
H  0.967268 2.769673 -1.012973
H  -0.207462 1.706978 -1.964904
H  -2.12767 0.670675 -1.700346
H  -1.536735 0.908029 2.601206
H  -4.406937 -0.258939 -1.334727
H  -3.828903 -0.02367 2.966863
H  1.04903 -3.776261 0.020493
H  0.625905 -3.193406 -1.640482
H  4.455539 0.249122 1.508117
H  4.918279 -1.094119 0.38647
H  -5.277794 -0.615653 0.996699
H  -1.340513 -3.276787 0.764878
H  -1.740207 -2.749133 -0.899414
H  -1.322656 -4.461825 -0.579252
H  4.987158 1.94622 -0.26634
H  5.400327 0.63784 -1.426147
H  6.42216 0.916311 0.016995
