program: Gaussian 09
title: 000258817
version: EM64L-G09RevD.01
frameworkgroup: C1[X(C14H10Br2N2O2)]
method: RPBEPBE
basis: SDD
operation: Freq
keyword: #p
keyword: freq=noraman
keyword: PBEPBE/SDD
title: #p freq=noraman PBEPBE/SDD
converged: YES YES NO NO
title: Mulliken charges:
elementType: Br Br O O N N C C C C C C C C C C C C C C H H H H H H H H H H
charge: 0.032574 0.032570 -0.319301 -0.319278 -0.344165 -0.344161 0.289076 0.289071 0.204936 0.204914 -0.334835 -0.334835 -0.324729 -0.324725 -0.180923 -0.180924 -0.192044 -0.192048 -0.206010 -0.206011 0.284210 0.284207 0.219318 0.219319 0.356506 0.356515 0.258079 0.258078 0.257308 0.257307
chargesum: 0.00000
title: Mulliken charges with hydrogens summed into heavy atoms:
elementType: Br Br O O N N C C C C C C C C C C C C C C
charge: 0.032574 0.032570 -0.319301 -0.319278 0.012341 0.012354 0.289076 0.289071 0.204936 0.204914 -0.050625 -0.050629 -0.105411 -0.105406 0.077156 0.077154 0.065265 0.065259 -0.206010 -0.206011
polarizability: 4.60964357e+02 -8.68214766e-01 1.87212908e+02 -4.97174033e-03 -6.96467786e-04 7.18906973e+01
1716.lowfreq: -6.3489 -4.9885 -2.0118 -0.0007 -0.0004 0.0005 0.6208 8.5337 14.4806
frequency: -6.3488 7.9774 14.4806 26.6442 64.5326 81.6943 89.2365 112.3261 147.8912 174.9395 199.2431 239.0443 250.3976 263.9396 293.0285 294.3447 321.6193 374.8325 400.9262 402.2484 461.2833 472.8426 474.3578 479.9330 520.4093 592.4653 612.0361 621.5089 621.6562 662.0365 685.4460 685.9114 698.2704 734.2741 734.3309 801.3989 821.3857 823.6002 855.8152 856.3075 917.7334 953.9709 954.1265 994.5604 994.6560 994.6860 995.7799 1037.5744 1060.5783 1063.3742 1093.0256 1117.0987 1117.1828 1191.4776 1193.0491 1214.6625 1236.9970 1282.2542 1301.3206 1310.9899 1364.2271 1368.3467 1391.4983 1393.9397 1412.7619 1469.6457 1482.6611 1517.9580 1533.2053 1553.1467 1582.6440 1593.9203 1595.9858 1598.6460 3137.8216 3137.8920 3158.5217 3158.5282 3174.6360 3174.6392 3178.9385 3178.9432 3490.9088 3505.4770
redmass: 3.6178 5.1036 16.3874 13.4178 8.5102 13.8000 7.9148 10.7227 12.2075 9.5364 6.1665 17.4172 6.3276 7.0627 12.2435 5.3887 6.0556 6.3722 2.7714 2.8494 8.0637 3.3539 6.9131 3.4319 5.6196 1.4106 1.1013 7.1280 7.1353 4.9476 3.0259 7.3806 7.4367 3.2048 3.4095 7.9305 1.4138 1.4241 1.4557 1.4752 5.8338 1.3830 1.3852 4.9034 1.3570 1.3571 4.7357 4.1559 3.0295 2.3895 2.1365 1.5164 1.3969 1.2186 1.1659 3.4296 1.5400 1.8303 1.2679 1.6393 4.5309 5.1952 4.1836 3.8172 2.9565 2.2841 2.6536 11.2169 2.4634 7.2652 7.7952 6.7551 5.9550 5.9817 1.0893 1.0893 1.0889 1.0889 1.0954 1.0954 1.0972 1.0972 1.0787 1.0794
irintensity: 0.0074 0.0000 0.0029 0.6440 0.0000 0.0000 0.0079 12.2245 0.0000 21.6031 0.0000 4.7241 0.0000 4.1559 0.0014 50.7650 0.0001 0.0000 0.4465 0.0000 30.8685 15.6886 0.0008 0.0001 23.2868 0.0031 209.4921 0.0000 4.1277 43.1770 0.0020 13.7463 0.0000 0.0225 49.5297 43.5509 49.7003 0.0003 73.1258 0.0002 0.0000 0.4651 0.0002 149.4132 2.3231 0.0008 0.0001 0.0000 78.2305 0.0000 30.6876 26.3860 0.0020 0.0001 34.5269 0.0000 3.1536 0.0000 0.1764 0.0000 49.8276 0.0000 119.2910 0.0000 1263.7657 0.0000 83.4050 315.4837 0.0006 0.0001 47.8425 0.0001 203.9496 0.0001 25.0669 1.0994 0.3907 0.4043 2.1517 6.6668 1.7434 3.5211 0.0101 180.2775
temp: 298.150 k
press: 1.00000 atm
elementType: 35 35 8 8 7 7 6 6 6 6 6 6 6 6 6 6 6 6 6 6 1 1 1 1 1 1 1 1 1 1
symmnumber: 1
zpe: 551207.0 jmol-1
zpe.correction: 0.209944 hartree
zpe.thermalcorrener: 0.227467 hartree
zpe.thermalcorrenthalpy: 0.228411 hartree
zpe.thermalcorrgfe: 0.158978 hartree
zpe.sumelectzpe: -824.967092 hartree
zpe.sumelectthermal: -824.949570 hartree
zpe.sumelectthermalent: -824.948625 hartree
zpe.sumelectthermalfe: -825.018059 hartree
dipole: 0.0006 0.0000 -0.0002
dipole: 0.0007
quadrupole: -138.3047 -131.5587 -139.9377
quadrupole: 2.3612 -0.0003 -0.0007
quadrupole: -1.7043 5.0417 -3.3374 2.3612 -0.0003 -0.0007
hfenergy: -825.1770361 hartree
pointgroup: C01 [X(C14H10Br2N2O2)]
dipole: 0.0002482 -0.000022 0.0000763 debye
polarizability: 460.2369243|-14.1194012|187.9399889|0.0556672|-0.2013378|71.891049 unknown
InChI: InChI=1S/C14H10Br2N2O2/c15-11-5-1-9(2-6-11)13(19)17-18-14(20)10-3-7-12(16)8-4-10/h1-8,17-18H
charge 0 multiplicity 1
30 atoms
Br 7.720671 -0.713904 -0.032665
Br -7.719489 0.713759 -0.036146
O  1.262911 2.015057 -0.038833
O  -1.261983 -2.015837 -0.032084
N  0.669063 -0.199899 -0.035011
N  -0.667988 0.199095 -0.035928
C  3.065259 0.361377 -0.035425
C  -3.064188 -0.361987 -0.034695
C  1.633845 0.789428 -0.036384
C  -1.632805 -0.790189 -0.034025
C  4.041679 1.389996 -0.036735
C  -4.040707 -1.390509 -0.032544
C  3.489894 -0.993608 -0.033197
C  -3.488681 0.993037 -0.037168
C  5.416716 1.082657 -0.03591
C  -5.415714 -1.083034 -0.032908
C  4.86299 -1.316353 -0.032294
C  -4.861745 1.31592 -0.037516
C  5.812405 -0.271802 -0.033694
C  -5.811267 0.271465 -0.035412
H  3.697865 2.429114 -0.038478
H  -3.696992 -2.42966 -0.030627
H  2.773355 -1.822685 -0.032154
H  -2.772053 1.82204 -0.038884
H  0.777008 -1.219588 -0.033431
H  -0.775822 1.218813 -0.038005
H  6.164153 1.880534 -0.036903
H  -6.16323 -1.880837 -0.031211
H  5.186472 -2.360776 -0.030481
H  -5.18512 2.360376 -0.039352
