program: Gaussian 09
title: 000258822
version: EM64L-G09RevD.01
frameworkgroup: C1[X(C18H12Br2N2O2)]
method: RPBEPBE
basis: SDD
operation: Freq
keyword: #p
keyword: freq=noraman
keyword: PBEPBE/SDD
title: #p freq=noraman PBEPBE/SDD
converged: YES YES NO NO
title: Mulliken charges:
elementType: Br Br O O N N C C C C C C C C C C C C C C C C C C H H H H H H H H H H H H
charge: 0.057619 0.034402 -0.291997 -0.321951 -0.338263 -0.310276 0.199350 0.399273 0.175323 -0.389496 -0.430647 -0.379406 -0.425189 -0.240454 0.130411 -0.249917 -0.243306 0.335413 0.210187 -0.381314 -0.237971 -0.216933 -0.159836 -0.196787 0.268605 0.243112 0.272584 0.240662 0.236246 0.235253 0.234006 0.378057 0.332014 0.309399 0.258285 0.263540
chargesum: 0.00000
title: Mulliken charges with hydrogens summed into heavy atoms:
elementType: Br Br O O N N C C C C C C C C C C C C C C C C C C
charge: 0.057619 0.034402 -0.291997 -0.321951 0.039794 0.021738 0.199350 0.399273 0.175323 -0.120891 -0.187535 -0.106823 -0.184527 -0.004208 0.130411 -0.014663 -0.009299 0.335413 0.210187 -0.381314 0.071428 -0.216933 0.098449 0.066753
polarizability: 4.08544719e+02 -2.01166732e+01 2.98221447e+02 2.07175505e+01 -2.11254003e+01 1.22673986e+02
1716.lowfreq: -4.8060 -3.7370 -0.0004 -0.0004 -0.0004 3.6283 10.0659 26.0841 26.8859
frequency: 9.8672 25.9642 26.8533 37.3429 65.3183 68.4078 99.2199 112.5733 116.9494 148.4479 177.1102 184.5900 189.5097 201.5390 232.1206 265.5925 279.3122 308.1999 334.2707 349.2602 365.9558 412.2549 420.7866 442.7462 447.9023 472.7456 506.6822 521.6277 523.4463 528.9235 569.8103 614.5088 635.1780 647.4000 651.1447 656.0341 675.9217 710.0790 717.6715 742.8449 760.8113 771.7828 788.4022 789.4482 817.2674 828.1837 843.0148 890.0583 920.1510 940.9548 945.2583 964.0732 973.7666 990.6102 994.9781 1000.6528 1007.3682 1031.7844 1057.5858 1076.2549 1096.4023 1120.8271 1138.6949 1154.5334 1179.5558 1188.5890 1210.8187 1230.4173 1236.9379 1246.0554 1252.0028 1287.7262 1347.9970 1362.7038 1369.5712 1397.2900 1410.7533 1415.4541 1438.4485 1439.5571 1454.7127 1500.0201 1516.8406 1523.2915 1547.0747 1570.3182 1582.4646 1586.1537 1595.3257 1630.3469 3125.7675 3128.8524 3139.3445 3150.4281 3156.2667 3162.6995 3163.7533 3168.5072 3170.2329 3181.8988 3404.9757 3483.2340
redmass: 8.0227 7.6355 8.3738 7.8183 8.3609 8.1182 7.6388 10.3483 7.3125 5.6314 5.5710 8.0237 5.8489 62.9671 4.8725 7.1814 7.0575 6.3084 7.6324 7.3341 5.7693 3.8472 8.3683 3.5101 4.3419 3.2977 5.2346 5.9552 5.1031 6.3818 3.6234 1.7244 3.2978 4.8647 4.3082 1.4886 2.7551 6.4375 3.2577 3.7426 1.5898 6.9589 3.6369 2.2132 1.3356 1.6716 5.8503 1.6288 5.9541 1.4038 1.4017 1.3594 1.3819 6.3091 1.4440 1.3543 4.6382 2.5157 3.0763 2.6257 2.0292 2.1552 1.6388 1.3657 1.1464 1.3716 1.8710 1.8803 1.9044 1.8534 1.3773 1.8658 3.6544 3.9516 2.8083 2.9549 5.3890 3.4147 2.5345 2.4306 2.4967 3.6507 3.4464 4.4113 7.4101 7.7543 7.5902 7.4236 5.3923 6.5391 1.0872 1.0875 1.0888 1.0918 1.0942 1.0896 1.0911 1.0985 1.0996 1.0980 1.0820 1.0798
irintensity: 0.0022 1.0957 1.1078 0.3982 0.5481 0.1969 8.0564 1.2981 2.6247 3.1422 2.8596 1.1897 2.0722 0.0043 9.5205 0.3260 4.2500 1.5453 8.5648 3.2749 60.2709 1.3461 17.2704 2.6978 15.2962 0.5844 18.4465 9.5449 18.8070 7.1669 23.9036 31.6344 8.6319 1.7288 7.4500 131.7370 4.7074 19.0929 8.4886 1.6858 0.7975 1.5349 17.8125 59.1948 36.4074 49.7386 1.8288 9.1735 25.8598 1.1171 10.4659 4.3689 1.3597 88.1657 8.3667 1.0081 2.2907 7.2859 20.8381 4.9641 7.0093 2.7394 8.2103 0.3345 0.5656 7.4415 16.6921 19.0885 6.7692 14.9563 40.7610 2.9559 54.5830 125.8592 5.4014 243.5853 35.4898 605.5683 28.9068 3.6503 62.4549 244.0973 16.5180 143.2812 50.2771 5.3018 5.0594 9.8258 3.8523 1.0639 1.5426 3.9469 7.3020 13.9747 26.2150 1.2865 10.1860 24.0117 13.6050 2.7530 121.3767 63.6646
temp: 298.150 k
press: 1.00000 atm
elementType: 35 35 8 8 7 7 6 6 6 6 6 6 6 6 6 6 6 6 6 6 6 6 6 6 1 1 1 1 1 1 1 1 1 1 1 1
symmnumber: 1
zpe: 672034.3 jmol-1
zpe.correction: 0.255964 hartree
zpe.thermalcorrener: 0.276879 hartree
zpe.thermalcorrenthalpy: 0.277823 hartree
zpe.thermalcorrgfe: 0.201532 hartree
zpe.sumelectzpe: -978.341949 hartree
zpe.sumelectthermal: -978.321035 hartree
zpe.sumelectthermalent: -978.320091 hartree
zpe.sumelectthermalfe: -978.396381 hartree
dipole: -0.8783 -0.1606 -0.0497
dipole: 0.8943
quadrupole: -122.6689 -157.1318 -158.7802
quadrupole: 18.8945 8.0067 -6.5114
quadrupole: 23.5248 -10.9382 -12.5866 18.8945 8.0067 -6.5114
hfenergy: -978.5979138 hartree
pointgroup: C01 [X(C18H12Br2N2O2)]
dipole: -0.3489028 -0.0100437 0.0441746 debye
polarizability: 402.3643263|39.7216237|196.9251618|8.9513039|90.8083714|230.150663 unknown
InChI: InChI=1S/C18H12Br2N2O2/c19-12-8-9-16(20)15(10-12)18(24)22-21-17(23)14-7-3-5-11-4-1-2-6-13(11)14/h1-10,21-22H
charge 0 multiplicity 1
36 atoms
Br 3.152769 -1.086831 -2.830412
Br 6.654843 1.371267 2.359401
O  -0.874135 -1.344128 -2.26805
O  1.502421 0.505928 1.418201
N  -0.341697 -0.383908 -0.24884
N  1.004453 -0.409218 -0.61791
C  -3.339566 0.135218 0.098285
C  -4.710511 -0.082837 0.530629
C  -2.707406 -0.893621 -0.703918
C  -2.716172 1.382762 0.449582
C  -5.406345 -1.268272 0.125155
C  -3.44262 -2.017696 -1.114351
C  -5.363065 0.90574 1.339588
C  -4.792064 -2.209425 -0.702112
C  -1.276111 -0.874084 -1.150663
C  -3.383632 2.330434 1.229862
C  -4.71214 2.086832 1.69644
C  3.392125 0.067327 -0.056131
C  1.921204 0.068351 0.287725
C  4.060687 -0.350894 -1.241198
C  4.203652 0.577573 1.000352
C  5.59574 0.661667 0.873753
C  5.46538 -0.263062 -1.361713
C  6.248139 0.24451 -0.304553
H  -1.718962 1.621497 0.068744
H  -6.438081 -1.415905 0.465651
H  -2.947112 -2.75524 -1.753605
H  -6.393576 0.719484 1.66473
H  -5.334312 -3.103466 -1.026165
H  -2.886984 3.274654 1.477684
H  -5.219174 2.835616 2.314003
H  -0.50133 -0.077182 0.717768
H  1.180032 -0.80163 -1.553352
H  3.677935 0.896621 1.905477
H  5.953671 -0.591756 -2.283044
H  7.334742 0.309171 -0.405811
