program: Gaussian 09
title: 000258830
version: EM64L-G09RevD.01
frameworkgroup: C1[X(C18H13ClN2O2)]
method: RPBEPBE
basis: SDD
operation: Freq
keyword: #p
keyword: freq=noraman
keyword: PBEPBE/SDD
title: #p freq=noraman PBEPBE/SDD
converged: YES YES NO NO
title: Mulliken charges:
elementType: Cl O O N N C C C C C C C C C C C C C C C C C C H H H H H H H H H H H H H
charge: -0.041643 -0.306826 -0.313794 -0.334981 -0.342645 0.199270 0.400333 0.170990 -0.390584 -0.430690 -0.378049 -0.424978 -0.240529 0.133368 -0.249695 -0.243268 0.290607 0.196414 -0.334010 -0.325837 -0.208812 -0.219759 -0.096236 0.268185 0.243237 0.272996 0.240785 0.236344 0.235315 0.234094 0.376808 0.355418 0.282883 0.222117 0.261821 0.261351
chargesum: 0.00000
title: Mulliken charges with hydrogens summed into heavy atoms:
elementType: Cl O O N N C C C C C C C C C C C C C C C C C C
charge: -0.041643 -0.306826 -0.313794 0.041827 0.012773 0.199270 0.400333 0.170990 -0.122399 -0.187453 -0.105053 -0.184193 -0.004185 0.133368 -0.014380 -0.009174 0.290607 0.196414 -0.051127 -0.103720 0.053009 0.041592 -0.096236
polarizability: 4.04449280e+02 -2.26477277e+00 2.41423300e+02 1.52775882e+01 3.87968536e+00 1.11660194e+02
1716.lowfreq: -4.2329 -1.6879 0.0018 0.0020 0.0022 2.6528 15.0124 20.0660 32.5399
frequency: 14.9513 20.0581 32.5343 39.8013 73.9618 81.6487 108.3268 131.4986 168.8743 179.4922 187.3373 226.4109 250.1729 283.6021 304.2182 317.1554 336.1597 340.2500 404.2760 413.6882 430.8630 471.5521 472.2493 483.9280 500.7230 508.1466 525.0003 568.0215 602.6309 616.0672 623.7666 637.0541 651.4090 672.9727 702.2364 717.5164 734.2352 760.9731 765.2993 788.1059 789.1496 821.3391 828.3936 836.7963 852.2206 891.1395 912.3492 941.5500 949.7398 974.6229 989.3372 994.9994 998.6150 1001.0664 1005.9595 1031.7681 1049.3005 1073.3475 1078.3791 1113.1684 1130.5945 1154.4547 1179.7023 1186.2969 1193.3538 1215.8496 1236.8193 1237.3628 1264.5922 1292.4863 1304.9935 1368.3560 1370.2005 1393.1426 1398.8193 1410.3402 1415.4315 1439.7816 1453.6969 1478.2418 1510.6945 1520.5098 1529.0600 1562.1889 1585.5287 1592.3045 1596.9000 1600.4198 1630.2726 3125.9579 3129.1242 3136.1564 3139.0482 3150.8144 3156.2436 3158.9561 3168.8538 3170.0354 3174.2824 3178.8132 3482.2921 3496.3025
redmass: 3.9782 9.1111 6.8686 7.3472 7.4287 7.2765 10.0180 5.9209 5.8374 4.3144 9.3581 4.9054 6.9744 6.2942 10.9294 6.9924 8.4384 5.6914 2.8407 3.9003 4.4343 3.5692 3.4890 5.0679 6.7948 4.3551 6.9626 3.2392 1.5396 1.3233 5.6243 3.0641 5.9721 3.4739 6.8914 2.9245 3.2356 1.5349 6.9163 3.4420 2.3048 1.4030 1.7860 4.7319 1.4706 1.6110 5.6143 1.4003 1.3829 1.3816 1.3598 1.4335 4.0392 1.3527 4.6522 2.5785 3.2173 2.8214 2.1350 1.3839 2.1157 1.3703 1.1457 1.2067 1.2921 2.3509 2.0624 1.6607 1.7802 1.6847 1.5468 2.4002 4.8177 3.4655 3.3713 5.2999 3.2949 2.4235 2.4431 2.4891 4.6242 3.3468 4.1347 6.7258 7.4379 6.1760 6.2457 6.0342 6.5222 1.0871 1.0875 1.0895 1.0889 1.0918 1.0942 1.0889 1.0985 1.0994 1.0955 1.0973 1.0793 1.0797
irintensity: 0.0637 0.1931 1.2159 0.0513 0.3566 1.0907 10.9648 1.4266 3.6727 2.5513 9.8640 11.5385 1.2294 1.8451 1.2518 3.8529 1.0037 42.0393 0.3958 1.3124 4.6087 8.3095 9.7298 2.4545 34.3527 19.0152 0.8172 12.7157 45.2285 134.2289 8.1314 0.2208 12.2191 15.7650 9.3950 0.6453 25.9218 1.9565 15.6087 21.3024 55.6027 22.3623 41.7083 12.5167 39.7148 7.8480 1.4982 0.2883 0.1826 1.3230 1.8198 2.7386 51.4135 0.8440 0.3734 5.2366 5.1370 30.0010 40.9205 21.0688 2.3549 0.2094 0.2691 12.5726 2.5972 2.6918 13.0444 3.3973 10.0980 4.6728 0.5009 91.9364 13.1639 330.2845 61.5606 28.8895 637.1355 5.4558 58.5886 38.0826 78.7969 54.3954 194.6037 15.2789 11.0627 16.0002 13.3535 65.8312 1.2533 1.3074 3.6584 11.3329 7.8700 14.1452 25.7361 0.1587 25.7481 11.2704 2.8047 2.5543 16.0329 137.7414
temp: 298.150 k
press: 1.00000 atm
elementType: 17 8 8 7 7 6 6 6 6 6 6 6 6 6 6 6 6 6 6 6 6 6 6 1 1 1 1 1 1 1 1 1 1 1 1 1
symmnumber: 1
zpe: 701009.8 jmol-1
zpe.correction: 0.267001 hartree
zpe.thermalcorrener: 0.286185 hartree
zpe.thermalcorrenthalpy: 0.287130 hartree
zpe.thermalcorrgfe: 0.216162 hartree
zpe.sumelectzpe: -1412.160596 hartree
zpe.sumelectthermal: -1412.141411 hartree
zpe.sumelectthermalent: -1412.140467 hartree
zpe.sumelectthermalfe: -1412.211434 hartree
dipole: 2.4876 0.4163 0.3175
dipole: 2.5421
quadrupole: -122.2747 -136.3532 -143.7002
quadrupole: 4.2147 5.0958 -4.4688
quadrupole: 11.8347 -2.2438 -9.5908 4.2147 5.0958 -4.4688
hfenergy: -1412.4275962 hartree
pointgroup: C01 [X(C18H13Cl1N2O2)]
dipole: -0.974697 -0.1135695 0.1931765 debye
polarizability: 403.466904|-8.7173627|227.6725007|-21.2275238|-39.9424957|126.3933683 unknown
InChI: InChI=1S/C18H13ClN2O2/c19-14-10-8-13(9-11-14)17(22)20-21-18(23)16-7-3-5-12-4-1-2-6-15(12)16/h1-11,20-21H
charge 0 multiplicity 1
36 atoms
Cl 8.050014 0.100963 -0.434864
O  -0.561181 2.071134 -1.382169
O  1.542156 -1.266302 1.290564
N  -0.22518 0.297026 0.030642
N  1.145566 0.435859 -0.200541
C  -3.261859 -0.139435 -0.065414
C  -4.660793 -0.041526 0.318825
C  -2.536521 1.091679 -0.31009
C  -2.701977 -1.453909 -0.229189
C  -5.289929 1.24337 0.403824
C  -3.205986 2.325474 -0.258095
C  -5.406511 -1.237341 0.585831
C  -4.581994 2.406525 0.098555
C  -1.073419 1.180756 -0.617785
C  -3.458884 -2.599833 0.029129
C  -4.818116 -2.495597 0.457911
C  3.473702 -0.234334 0.200317
C  2.012702 -0.402472 0.47265
C  4.36856 -0.965384 1.023294
C  3.997925 0.594299 -0.827418
C  5.762202 -0.869532 0.838961
C  5.39043 0.699749 -1.024233
C  6.252484 -0.033155 -0.183747
H  -1.680979 -1.569891 -0.604346
H  -6.34426 1.294558 0.700395
H  -2.637561 3.232066 -0.488438
H  -6.457515 -1.143653 0.883976
H  -5.071484 3.384544 0.145413
H  -3.00871 -3.588695 -0.109485
H  -5.396002 -3.402618 0.6641
H  -0.45807 -0.384929 0.761123
H  1.356335 1.215192 -0.833935
H  3.946509 -1.607561 1.802582
H  3.342501 1.155316 -1.503097
H  6.45221 -1.431608 1.474321
H  5.796937 1.334162 -1.816566
