program: Gaussian 09
title: 000258793
version: EM64L-G09RevD.01
frameworkgroup: C1[X(C14H27N)]
method: RPBEPBE
basis: SDD
operation: Freq
keyword: #pfreq=noraman
keyword: PBEPBE/SDD
title: #p freq=noraman PBEPBE/SDD
converged: YES YES NO NO
title: Mulliken charges:
elementType: N C C C C C C C C C C C C C C H H H H H H H H H H H H H H H H H H H H H H H H H H H
charge: -0.144930 -0.068937 -0.435688 -0.355475 -0.364502 -0.418756 -0.043231 -0.037418 -0.251588 -0.441058 -0.194448 -0.695773 -0.706968 -0.702344 -0.711214 0.201060 0.214033 0.204268 0.183408 0.193506 0.183365 0.213893 0.204458 0.202118 0.192905 0.191873 0.230623 0.210483 0.211427 0.200511 0.192231 0.206484 0.239624 0.203745 0.215920 0.209606 0.197185 0.206516 0.232832 0.205472 0.214894 0.209891
chargesum: 0.00000
title: Mulliken charges with hydrogens summed into heavy atoms:
elementType: N C C C C C C C C C C C C C C
charge: -0.144930 0.132123 -0.017387 0.021438 0.032755 -0.012180 0.149674 0.154454 -0.020964 -0.019147 0.006063 -0.057434 -0.077697 -0.065812 -0.080957
polarizability: 1.80395404e+02 2.81961954e+00 1.56144804e+02 -1.94499397e-01 4.81382453e+00 1.35515384e+02
1716.lowfreq: -15.1465 -8.3725 -0.0007 -0.0005 -0.0003 5.8779 16.4061 48.8627 52.8994
frequency: 15.6257 48.7498 52.5212 54.6791 64.5880 78.2920 139.2097 182.0373 182.6630 207.0486 209.0943 224.7684 233.8104 247.8906 253.6627 292.5036 315.0309 334.1168 381.6765 386.0510 393.3267 411.4569 435.5164 464.7401 489.9810 531.8416 596.7619 662.6209 725.1698 783.7990 813.1615 818.4889 845.6991 865.5258 892.7424 896.2377 909.3926 914.3759 917.2990 933.4589 943.7481 950.9559 958.1603 961.0580 977.2040 985.7292 1051.1473 1065.5149 1077.2673 1082.6066 1095.5733 1124.2771 1131.5230 1136.7954 1165.7298 1179.6936 1181.6356 1189.9125 1197.7762 1219.0374 1241.0296 1261.7100 1273.3757 1294.2274 1298.6090 1307.8798 1315.7245 1326.8259 1331.8542 1335.6212 1339.2544 1349.7262 1360.2536 1363.5431 1368.1316 1373.0535 1379.1438 1389.1856 1392.4951 1454.7907 1459.6081 1461.1670 1466.3872 1466.7556 1468.4146 1471.8140 1473.1781 1475.3114 1479.3158 1479.5224 1486.0283 1491.7076 1668.6912 2858.3427 2867.4517 2949.0662 2950.9023 2961.4729 2964.0130 2964.5462 2965.1377 2967.7187 2968.5231 2973.6099 2980.7678 3004.7779 3009.1304 3016.7792 3034.0703 3043.5529 3054.6904 3054.7744 3061.3530 3062.7552 3069.4464 3069.5916 3080.7359 3084.7519 3091.1349 3125.0169
redmass: 2.7136 2.7657 2.7404 3.0661 2.9406 3.1237 2.4649 1.6491 1.6661 2.2620 1.0715 1.3586 1.6706 1.2298 1.8146 2.2078 2.2844 2.6203 2.4190 2.7871 2.1172 1.9733 2.0355 2.4290 3.7239 3.8751 2.4305 2.2005 1.5209 2.0710 2.5771 2.4685 3.1133 2.1897 1.7594 1.4397 1.3874 1.2798 1.2798 2.0154 1.7864 1.6561 1.5152 1.6540 2.4547 1.2259 1.9768 2.3178 2.3160 1.6124 2.2049 1.2729 2.0136 2.1218 2.0097 1.8151 1.8944 1.5965 1.9623 1.2813 1.2725 1.2067 1.2212 1.3454 1.3546 1.4553 1.4914 1.4123 1.5003 1.4537 1.4463 1.3633 1.3333 1.2971 1.2328 1.2679 1.5733 1.2192 1.2366 1.0890 1.0596 1.0684 1.0672 1.0631 1.0587 1.0807 1.0708 1.0655 1.0522 1.0528 1.0555 1.0521 7.0117 1.0699 1.0696 1.0810 1.0642 1.0796 1.0613 1.0388 1.0526 1.0380 1.0367 1.0636 1.0604 1.0927 1.0896 1.0885 1.0995 1.1036 1.0989 1.0991 1.0986 1.0985 1.0989 1.0990 1.0990 1.0984 1.0843 1.0981
irintensity: 0.0343 0.0087 0.0532 0.0076 0.0352 0.1688 0.3483 1.0237 0.3383 1.0781 0.1077 0.4373 0.0946 0.0689 0.0942 0.2532 0.0894 1.6126 0.2653 1.9778 0.5933 1.1868 3.6201 7.0073 0.6131 2.2237 13.1993 14.7660 18.1076 3.8617 3.6584 5.1974 9.8438 4.7375 7.2023 0.9725 3.3390 8.1384 3.9134 5.6992 1.7153 7.8634 3.1483 4.3231 5.9629 1.2476 25.4862 55.7606 10.8798 3.6799 48.8358 5.3417 4.6273 1.8603 11.3666 5.9092 2.4614 4.7689 2.9326 6.7721 1.4957 3.4911 9.1972 0.6201 4.1477 0.2715 5.5870 6.1530 2.7026 1.3062 1.9139 0.5320 0.1706 9.1662 2.5069 29.8682 6.8578 30.7783 11.5647 7.6726 0.8888 2.3713 4.0455 7.3500 1.3906 10.9042 2.7088 14.0294 7.2972 5.5272 25.0016 21.9924 5.1594 34.3638 139.2698 13.4654 48.0649 16.8763 19.2101 38.5166 27.0528 45.9041 36.0496 31.9735 33.0555 54.7958 14.4613 34.1889 54.3044 61.8499 27.5045 9.6943 46.7507 106.3717 44.7726 68.3385 48.8171 24.5232 10.6485 38.8606
temp: 298.150 k
press: 1.00000 atm
elementType: 7 6 6 6 6 6 6 6 6 6 6 6 6 6 6 1 1 1 1 1 1 1 1 1 1 1 1 1 1 1 1 1 1 1 1 1 1 1 1 1 1 1
symmnumber: 1
zpe: 1000194.2 jmol-1
zpe.correction: 0.380954 hartree
zpe.thermalcorrener: 0.399039 hartree
zpe.thermalcorrenthalpy: 0.399983 hartree
zpe.thermalcorrgfe: 0.334036 hartree
zpe.sumelectzpe: -603.174267 hartree
zpe.sumelectthermal: -603.156182 hartree
zpe.sumelectthermalent: -603.155238 hartree
zpe.sumelectthermalfe: -603.221185 hartree
dipole: 0.6938 -0.3967 -0.9264
dipole: 1.2235
quadrupole: -93.0713 -96.1949 -97.5004
quadrupole: 0.0739 0.3248 0.3735
quadrupole: 2.5175 -0.6060 -1.9115 0.0739 0.3248 0.3735
hfenergy: -603.5552206 hartree
pointgroup: C01 [X(C14H27N1)]
dipole: 0.2813588 0.0932688 0.3792719 debye
polarizability: 179.3506569|-5.7877951|156.2691818|1.2613061|6.2782898|136.4357533 unknown
InChI: InChI=1S/C14H27N/c1-12(2)10-15(11-13(3)4)14-8-6-5-7-9-14/h6,8,12-14H,5,7,9-11H2,1-4H3
charge 0 multiplicity 1
42 atoms
N  -0.431037 0.093727 0.124958
C  1.002222 0.479915 -0.067416
C  1.876132 0.461986 1.224279
C  -1.243655 1.125934 0.815253
C  -0.63592 -1.279421 0.652323
C  3.363505 0.708047 0.878128
C  -1.632531 2.335326 -0.078023
C  -1.930375 -1.959427 0.127169
C  1.641995 -0.377585 -1.151452
C  3.916533 -0.41825 -0.029143
C  2.939379 -0.782704 -1.134454
C  -2.538278 1.898053 -1.249513
C  -2.309715 3.427523 0.783175
C  -1.840643 -2.233973 -1.390015
C  -2.204729 -3.259234 0.919213
H  0.981647 1.52627 -0.441753
H  1.776077 -0.525045 1.717721
H  1.518045 1.225005 1.94153
H  -0.736642 1.508892 1.736393
H  -2.181178 0.645936 1.157898
H  -0.651703 -1.295583 1.770952
H  0.227114 -1.898214 0.336524
H  3.969508 0.786074 1.801271
H  3.456885 1.67842 0.349514
H  -0.703368 2.767117 -0.505765
H  -2.779047 -1.264201 0.299561
H  0.980382 -0.652765 -1.984029
H  4.138372 -1.322064 0.578374
H  4.88515 -0.111395 -0.472676
H  3.319912 -1.403726 -1.958177
H  -3.519316 1.54599 -0.873357
H  -2.724366 2.735505 -1.947474
H  -2.067072 1.069228 -1.806169
H  -3.237875 3.040634 1.247739
H  -2.584098 4.304423 0.168262
H  -1.644386 3.775959 1.596231
H  -1.060395 -2.991071 -1.60353
H  -2.800528 -2.613474 -1.787264
H  -1.577838 -1.307282 -1.929977
H  -1.367177 -3.974403 0.801674
H  -3.12316 -3.757211 0.55741
H  -2.328321 -3.057838 2.000437
