program: Gaussian 09
title: 000258837
version: EM64L-G09RevD.01
frameworkgroup: C1[X(C21H21NO2)]
method: RPBEPBE
basis: SDD
operation: Freq
keyword: #p
keyword: freq=noraman
keyword: PBEPBE/SDD
title: #p freq=noraman PBEPBE/SDD
converged: YES YES NO NO
title: Mulliken charges:
elementType: O O N C C C C C C C C C C C C C C C C C C C C C H H H H H H H H H H H H H H H H H H H H H
charge: -0.261919 -0.261275 -0.153175 -0.114680 -0.490555 -0.381647 -0.450425 -0.620182 0.450780 0.257729 0.212680 -0.823877 0.245278 0.442226 0.167223 -0.354622 -0.406422 -0.468712 -0.357265 -0.278666 -0.265535 -0.251760 -0.258413 -0.502121 0.229583 0.231092 0.253809 0.230984 0.229092 0.230539 0.209603 0.263019 0.220983 0.240322 0.276685 0.223530 0.243534 0.222682 0.222605 0.225693 0.228572 0.226756 0.239925 0.232137 0.244191
chargesum: 0.00000
title: Mulliken charges with hydrogens summed into heavy atoms:
elementType: O O N C C C C C C C C C C C C C C C C C C C C C
charge: -0.261919 -0.261275 -0.153175 0.114903 -0.005654 0.078429 -0.010283 -0.136181 0.450780 0.257729 0.212680 -0.583555 0.245278 0.442226 0.167223 -0.077937 -0.182892 -0.225178 -0.134583 -0.056061 -0.039842 -0.023188 -0.031657 0.214132
polarizability: 3.32551614e+02 3.77202024e+01 2.70047005e+02 1.21300484e+01 -1.93285402e+01 1.42486735e+02
1716.lowfreq: -1.0298 -0.0010 -0.0009 -0.0004 7.5174 8.6625 14.7102 24.1573 41.5104
frequency: 10.7102 23.7692 41.4861 44.5481 60.2918 83.4232 96.3983 101.1946 103.8721 147.6143 158.0958 176.0941 212.4354 241.0590 243.8797 257.5976 297.2435 309.4305 311.1386 364.0699 402.4807 405.9349 421.7184 433.5827 460.0269 510.1796 519.7005 544.2783 550.4799 559.3035 587.9388 614.1662 620.1539 652.6985 692.9013 708.0055 715.5947 738.7267 758.3880 764.9370 775.7372 787.2007 808.9272 811.4550 857.3244 862.6738 870.1983 886.9076 887.8651 921.7410 927.0189 933.9130 956.1263 962.3993 976.1903 987.3581 990.4321 991.6028 1000.7181 1025.5920 1039.5477 1041.1815 1059.6150 1084.8110 1104.2145 1107.4131 1112.2550 1122.1113 1146.6442 1152.2297 1163.6919 1176.4953 1182.9873 1208.0183 1216.0522 1221.2415 1232.0531 1252.9555 1264.2279 1265.7897 1276.0130 1295.5620 1298.8488 1305.6246 1315.9116 1325.9346 1335.4775 1373.7418 1383.4361 1400.2911 1407.7953 1420.9212 1436.6340 1447.2920 1451.4696 1454.1894 1461.4927 1469.4925 1474.9766 1481.4211 1494.4539 1498.0959 1533.9582 1578.8229 1609.5585 1617.4561 1621.9695 1630.6648 2856.6973 2914.4368 2977.3090 2998.4056 3003.4656 3014.5313 3030.6071 3039.5263 3072.0743 3100.9405 3105.7851 3106.5433 3119.5576 3125.1106 3131.8633 3141.5700 3148.9845 3149.6226 3160.3167 3166.2326 3184.3380
redmass: 4.8670 4.4360 3.4358 4.7740 4.0200 1.4219 3.9923 2.4185 3.9159 2.9222 4.5076 3.8702 4.0138 3.1502 3.8267 3.1035 3.5804 4.0508 4.0585 2.5887 6.5498 4.9540 4.0591 3.2991 4.7218 4.1909 3.2904 3.2824 2.5643 3.8241 3.1796 6.2527 3.5060 4.9453 4.4278 4.7894 6.6934 2.1800 1.9024 1.8299 4.8258 2.3172 1.8229 3.2444 2.5327 2.6683 1.4693 1.6413 1.8164 2.1835 2.0874 2.1687 1.4331 1.4244 4.0873 1.3627 1.4016 5.8055 1.9751 2.4339 2.9556 2.2100 2.2096 1.9190 2.8441 2.4422 1.2779 2.3740 1.4607 1.4405 1.5257 1.0696 1.1052 1.8807 1.3396 4.1010 1.4180 2.0452 1.7141 1.4363 1.3244 1.5930 1.2243 1.3805 2.1756 1.3966 1.4270 1.6991 2.4300 5.6632 2.9251 1.1924 2.4380 2.4201 1.0809 3.1100 1.0509 1.0858 1.0950 1.1005 1.0953 3.1187 3.8456 7.5687 5.8129 9.2554 6.3917 6.9282 1.0712 1.0834 1.0634 1.0642 1.0295 1.0872 1.0633 1.0971 1.1024 1.1047 1.1044 1.0910 1.0864 1.0854 1.0883 1.0913 1.1048 1.0938 1.0983 1.0974 1.0946
irintensity: 0.2389 0.7157 3.8211 2.3663 0.5746 1.3463 0.3828 0.0463 0.5275 0.9772 1.8722 4.8112 4.7255 1.4652 0.3289 0.0400 0.4601 1.8395 10.7480 12.6677 1.0551 2.1696 7.9398 4.7673 0.2839 2.1272 2.2050 1.7414 1.8617 1.3044 1.8851 5.2742 6.1528 3.6064 4.6182 5.4937 22.7773 63.4508 44.6407 7.1849 8.6127 52.9056 4.3761 7.2462 3.1731 3.3753 5.6998 8.8319 4.0127 20.8627 6.5729 6.1742 1.6976 7.9527 73.2710 0.5531 0.8050 0.9095 11.9924 33.6333 3.7062 15.3460 2.2904 48.5900 20.6926 8.4497 0.4495 14.0404 13.7416 2.2376 20.7746 0.4498 0.1469 10.8470 2.2296 157.6512 8.3843 6.4404 2.8677 4.1987 4.1236 0.4422 17.3968 3.1819 2.1743 12.4833 7.1171 9.9041 7.3211 1.8138 3.3515 18.2026 12.9451 10.1789 11.4048 0.3648 8.6036 10.0943 11.7311 11.2063 1.6515 12.8259 3.6477 0.7731 3.0111 160.4530 1.6255 1.4421 80.3744 59.1351 43.2730 35.9022 30.5808 4.5450 31.1734 20.7873 39.5108 26.7553 30.9837 17.0630 6.7264 2.3429 10.7620 29.9368 16.8888 5.9854 37.5065 45.9164 6.6950
temp: 298.150 k
press: 1.00000 atm
elementType: 8 8 7 6 6 6 6 6 6 6 6 6 6 6 6 6 6 6 6 6 6 6 6 6 1 1 1 1 1 1 1 1 1 1 1 1 1 1 1 1 1 1 1 1 1
symmnumber: 1
zpe: 964608.1 jmol-1
zpe.correction: 0.367400 hartree
zpe.thermalcorrener: 0.388312 hartree
zpe.thermalcorrenthalpy: 0.389256 hartree
zpe.thermalcorrgfe: 0.315013 hartree
zpe.sumelectzpe: -1016.331554 hartree
zpe.sumelectthermal: -1016.310642 hartree
zpe.sumelectthermalent: -1016.309698 hartree
zpe.sumelectthermalfe: -1016.383941 hartree
dipole: 1.0797 -1.1642 -1.7395
dipole: 2.3552
quadrupole: -122.6794 -122.3572 -148.8172
quadrupole: 1.4417 -2.9806 -7.2276
quadrupole: 8.6052 8.9274 -17.5326 1.4417 -2.9806 -7.2276
hfenergy: -1016.6989537 hartree
pointgroup: C01 [X(C21H21N1O2)]
dipole: 0.4468606 0.4763127 0.6572983 debye
polarizability: 330.2773021|-40.0875387|270.0522459|-14.0622198|-23.7744622|144.7558061 unknown
InChI: InChI=1S/C21H21NO2/c1-24-21(23)20-11-6-12-22(20)14-16-13-15-7-2-3-8-17(15)19-10-5-4-9-18(16)19/h2-5,7-10,13,20H,6,11-12,14H2,1H3
charge 0 multiplicity 1
45 atoms
O  4.655771 -0.696579 0.409722
O  3.739373 -0.96548 -1.709893
N  1.9895 1.066989 -0.104953
C  3.416281 1.181571 -0.546434
C  4.10192 2.071184 0.517591
C  1.732286 2.05619 0.987263
C  2.955487 3.007817 0.973319
C  1.002394 0.992255 -1.210215
C  -0.388277 0.56892 -0.753947
C  3.956143 -0.242641 -0.705326
C  -0.653511 -0.782931 -0.270578
C  -1.427754 1.481946 -0.816937
C  -1.987093 -1.148658 0.150483
C  -2.77278 1.160988 -0.403527
C  -3.068289 -0.159285 0.091529
C  0.384911 -1.76584 -0.224316
C  -2.212134 -2.484756 0.605692
C  -3.810026 2.141342 -0.479253
C  -4.410097 -0.437564 0.49673
C  0.130792 -3.068502 0.220423
C  -1.178954 -3.42981 0.642639
C  -5.116046 1.840023 -0.076151
C  -5.414675 0.537523 0.416692
C  5.074379 -2.119543 0.36858
H  3.482748 1.655413 -1.552841
H  4.969507 2.611089 0.102425
H  4.451786 1.449623 1.358107
H  1.650309 1.538734 1.962712
H  0.77727 2.584713 0.811593
H  3.149852 3.467284 1.957837
H  2.804793 3.821551 0.238714
H  1.398602 0.268643 -1.948033
H  0.912779 1.973594 -1.74017
H  -1.235034 2.49525 -1.193418
H  1.393379 -1.485102 -0.535851
H  -3.212053 -2.789061 0.929087
H  -3.565228 3.139968 -0.860875
H  -4.672451 -1.428342 0.879722
H  0.937053 -3.81024 0.241001
H  -1.38131 -4.448014 0.993236
H  -5.905119 2.597298 -0.137758
H  -6.434979 0.296139 0.734706
H  4.186177 -2.773063 0.334233
H  5.641939 -2.271263 1.297239
H  5.698781 -2.309973 -0.520199
