program: Gaussian 09
title: 000258783
version: EM64L-G09RevD.01
frameworkgroup: C1[X(C12H23N)]
method: RPBEPBE
basis: SDD
operation: Freq
keyword: #pfreq=noraman
keyword: PBEPBE/SDD
title: #p freq=noraman PBEPBE/SDD
converged: YES YES NO NO
title: Mulliken charges:
elementType: N C C C C C C C C C C C C H H H H H H H H H H H H H H H H H H H H H H H
charge: -0.145228 -0.059886 -0.437625 -0.417627 -0.339918 -0.330170 -0.262883 -0.440865 -0.192617 -0.373258 -0.388762 -0.681649 -0.669358 0.208389 0.205661 0.212945 0.202096 0.203765 0.186613 0.216133 0.187632 0.194928 0.234313 0.211206 0.210202 0.200148 0.191329 0.193295 0.196382 0.198783 0.201242 0.236260 0.207216 0.200950 0.233932 0.206426
chargesum: 0.00000
title: Mulliken charges with hydrogens summed into heavy atoms:
elementType: N C C C C C C C C C C C C
charge: -0.145228 0.148503 -0.019020 -0.011765 0.062828 0.052390 -0.028570 -0.019457 0.007531 0.011366 0.006403 -0.036931 -0.028051
polarizability: 1.58469821e+02 -3.32138574e+00 1.29443412e+02 -6.14631281e-01 4.37406677e+00 1.15439007e+02
1716.lowfreq: -13.0867 -2.8812 0.0003 0.0005 0.0010 11.2267 15.5563 42.2599 62.7541
frequency: 6.0312 41.3006 62.7157 72.0339 85.0644 129.3597 169.3603 188.8903 198.4512 224.3155 240.5586 259.7961 288.6811 334.0168 370.4307 395.8162 406.6305 456.4883 487.7735 527.6745 588.2245 640.9958 726.1652 737.5923 772.4521 795.4813 829.9130 852.7747 861.7522 884.1381 895.3123 902.7679 911.0563 938.7674 966.5645 986.4070 1001.0541 1040.6267 1059.9845 1075.6655 1079.1941 1082.4899 1091.1996 1097.3518 1105.5872 1128.3545 1163.7266 1184.9602 1192.6236 1218.8639 1242.2449 1251.1039 1260.9633 1264.9428 1283.2626 1301.1276 1319.6957 1331.6967 1333.9247 1340.4093 1343.9017 1350.5088 1359.6000 1366.0819 1377.0401 1380.3198 1388.5241 1455.8045 1459.9546 1464.2980 1465.9694 1469.0160 1472.7804 1474.1539 1475.6596 1480.1582 1485.7867 1491.0864 1669.0848 2849.1900 2861.1531 2950.5087 2952.2943 2971.3271 2972.6996 2975.3217 2975.7532 2979.5792 2981.0700 3005.4186 3009.5845 3011.8592 3027.1174 3032.1307 3032.7054 3043.4593 3067.0520 3069.6511 3083.4917 3087.6853 3090.7354 3124.1922
redmass: 2.8262 2.8708 2.9801 2.7802 2.6286 1.8698 1.3743 1.3347 2.7479 1.9613 1.9403 1.8650 2.0914 2.1371 2.6415 2.7875 2.1959 2.5235 2.6452 2.9353 2.5782 2.0004 1.5620 1.5893 1.2759 1.6921 2.1421 2.5089 2.3865 1.7421 1.7446 1.4738 1.5107 2.1959 2.2827 1.2349 1.6657 1.9710 1.8754 2.0442 2.0086 1.7470 2.5203 2.0864 1.9112 1.1538 2.1889 1.8416 1.5635 1.2767 1.2730 1.1978 1.2375 1.1882 1.2962 1.3274 1.4798 1.4350 1.4998 1.4956 1.4244 1.3728 1.3131 1.3042 1.3626 1.4085 1.2515 1.0895 1.0753 1.0644 1.0536 1.0802 1.0836 1.0612 1.0729 1.0723 1.0706 1.0591 7.0103 1.0713 1.0703 1.0645 1.0806 1.0510 1.0632 1.0509 1.0452 1.0462 1.0606 1.0927 1.0930 1.0929 1.0952 1.0933 1.0992 1.1033 1.0995 1.0994 1.0997 1.0992 1.0841 1.0983
irintensity: 0.0518 0.0132 0.0526 0.0895 0.1887 0.3074 0.1907 0.9229 0.7924 2.2381 0.2557 0.2375 0.4797 0.7209 0.1965 4.4650 0.9987 3.9670 2.6165 3.5581 12.1191 16.7759 12.4847 14.1843 9.8964 4.1793 3.9234 6.5035 1.9405 4.5716 5.5616 1.3101 3.3875 2.5739 9.4145 3.1863 32.5540 42.8504 0.2117 3.8400 17.6011 4.9411 10.5680 7.1365 16.0576 4.3773 16.0672 8.6407 1.0573 6.2211 2.0924 3.0883 9.1994 1.0433 10.5774 1.9793 4.3107 4.3536 1.9108 2.5618 4.9756 0.1170 4.8117 4.2144 5.2095 7.5898 30.7832 8.1269 3.3029 1.6201 2.9698 10.5010 12.2437 4.4602 2.9656 15.2059 16.4829 20.6566 5.0106 46.1841 140.2995 36.1598 23.1397 56.8273 30.5952 75.0081 10.4986 20.2583 33.2549 53.9787 10.8836 12.9077 21.4737 67.3817 60.1952 62.6106 57.1995 79.7063 45.6966 48.6203 9.8233 39.4699
temp: 298.150 k
press: 1.00000 atm
elementType: 7 6 6 6 6 6 6 6 6 6 6 6 6 1 1 1 1 1 1 1 1 1 1 1 1 1 1 1 1 1 1 1 1 1 1 1
symmnumber: 1
zpe: 856948.0 jmol-1
zpe.correction: 0.326394 hartree
zpe.thermalcorrener: 0.341566 hartree
zpe.thermalcorrenthalpy: 0.342510 hartree
zpe.thermalcorrgfe: 0.282035 hartree
zpe.sumelectzpe: -524.724097 hartree
zpe.sumelectthermal: -524.708925 hartree
zpe.sumelectthermalent: -524.707980 hartree
zpe.sumelectthermalfe: -524.768456 hartree
dipole: -0.7260 -0.4017 -0.9225
dipole: 1.2407
quadrupole: -80.4987 -82.1006 -83.8559
quadrupole: -0.8889 -1.0551 0.3914
quadrupole: 1.6530 0.0511 -1.7041 -0.8889 -1.0551 0.3914
hfenergy: -525.0504908 hartree
pointgroup: C01 [X(C12H23N1)]
dipole: -0.2819702 -0.092086 -0.3876846 debye
polarizability: 157.8666655|-5.4881414|128.7770086|0.5726525|5.845615|116.708565 unknown
InChI: InChI=1S/C12H23N/c1-3-10-13(11-4-2)12-8-6-5-7-9-12/h6,8,12H,3-5,7,9-11H2,1-2H3
charge 0 multiplicity 1
36 atoms
N  0.797437 -0.107518 -0.321944
C  -0.621001 -0.434377 0.01924
C  -1.601758 -0.500862 -1.192161
C  -3.060883 -0.660808 -0.705432
C  0.992935 1.229735 -0.940469
C  1.523364 -1.188793 -1.033574
C  -1.144635 0.530413 1.075664
C  -3.502105 0.558479 0.140163
C  -2.427358 0.976613 1.130172
C  2.352779 1.877589 -0.580083
C  1.781266 -2.453035 -0.17923
C  2.499492 2.172779 0.926679
C  2.588983 -2.166885 1.103533
H  -0.594211 -1.443465 0.48395
H  -1.327239 -1.338254 -1.86176
H  -1.51497 0.433308 -1.782184
H  -3.139078 -1.578577 -0.087895
H  -3.744215 -0.794573 -1.566158
H  0.894479 1.188972 -2.054262
H  0.184868 1.890878 -0.57248
H  1.005935 -1.488662 -1.980611
H  2.505174 -0.777984 -1.336293
H  -0.408326 0.847877 1.826773
H  -4.441039 0.328623 0.682925
H  -3.742522 1.415651 -0.525263
H  -2.721665 1.673589 1.928008
H  3.181691 1.220077 -0.910679
H  2.451063 2.815896 -1.163648
H  0.821395 -2.939513 0.08546
H  2.324736 -3.18151 -0.814644
H  1.738624 2.902923 1.263037
H  2.358552 1.243719 1.506767
H  3.49698 2.587554 1.162529
H  3.586152 -1.754324 0.858264
H  2.065939 -1.421121 1.727315
H  2.736866 -3.086317 1.699591
