program: Gaussian 09
title: 000258769
version: EM64L-G09RevD.01
frameworkgroup: C1[X(C9H14N2O2)]
method: RPBEPBE
basis: SDD
operation: Freq
keyword: #p
keyword: freq=noraman
keyword: PBEPBE/SDD
title: #p freq=noraman PBEPBE/SDD
converged: YES YES NO NO
title: Mulliken charges:
elementType: O O N N C C C C C C C C C H H H H H H H H H H H H H H
charge: -0.483053 -0.437527 -0.086128 -0.159625 -0.516769 -0.336975 0.218657 -0.649787 -0.317882 0.174052 -0.316219 -0.334606 -0.147421 0.261440 0.234664 0.188862 0.197418 0.221517 0.243844 0.193223 0.178987 0.193631 0.229984 0.255335 0.233743 0.399168 0.361466
chargesum: 0.00000
title: Mulliken charges with hydrogens summed into heavy atoms:
elementType: O O N N C C C C C C C C C
charge: -0.083884 -0.076061 -0.086128 -0.159625 -0.020665 0.049305 0.218657 0.008797 0.054736 0.174052 -0.086235 -0.079271 0.086322
polarizability: 1.50886574e+02 -3.82506053e+00 1.32113246e+02 -8.21296954e+00 4.42440063e+00 7.52755622e+01
1716.lowfreq: -5.9859 0.0005 0.0006 0.0007 4.4289 9.2866 30.8185 78.4701 83.8463
frequency: 30.4766 78.4688 83.7850 100.0216 175.2694 203.5151 209.2371 224.4153 245.5972 286.0172 341.0733 357.3266 359.9326 410.9083 439.3741 473.2276 502.9891 528.9124 560.8249 607.3851 713.7616 751.4450 784.9243 803.8472 859.9457 864.8557 897.5976 908.8397 939.1676 954.1028 959.0889 1027.4881 1056.1381 1058.9306 1072.0206 1073.0316 1109.1235 1131.4199 1153.6578 1186.8710 1219.2577 1236.0344 1247.7401 1270.6348 1293.2887 1318.3853 1347.4481 1349.8290 1365.6283 1370.6294 1429.1090 1431.8952 1447.7314 1453.1912 1456.6345 1463.3448 1471.5434 1476.7474 1485.1543 1573.6146 1586.8217 2854.6409 2876.6585 2933.3750 2964.1350 2984.2660 3013.9311 3018.5708 3034.3096 3047.6629 3080.2510 3120.4105 3149.7276 3174.8442 3569.6793
redmass: 3.8676 3.8403 3.9174 4.3455 4.0238 1.4913 2.4981 2.6751 4.3052 3.7168 3.1596 1.1501 2.5107 2.7126 2.4206 4.1604 2.0034 5.6229 4.6616 5.4274 3.7148 3.8655 1.7473 3.3649 3.7919 3.2677 1.3738 1.9962 1.3346 1.7389 1.3660 2.5579 1.9271 2.1487 2.3452 2.7314 1.3926 1.7411 1.2205 1.6284 1.3270 1.9949 2.4002 1.8895 1.3357 2.3244 1.4759 2.0224 1.2391 1.3043 1.6740 1.2874 1.1130 1.1527 1.4809 1.2480 1.1339 1.2531 1.0537 6.4820 6.0311 1.0574 1.0683 1.0651 1.0735 1.0581 1.0903 1.0735 1.0968 1.1051 1.1007 1.0904 1.0896 1.1000 1.0661
irintensity: 0.0276 5.2468 2.8757 0.8236 2.4415 0.7552 0.5162 2.2597 14.4428 8.9618 9.3900 121.7268 5.4329 4.6758 0.9570 3.1361 10.6597 14.4710 0.9963 19.5101 14.6109 2.4281 55.1188 25.0184 27.4493 10.8299 1.8064 32.9373 40.7341 31.5457 1.3013 48.5954 38.3463 9.1339 140.2208 32.0090 9.5225 25.7902 39.4660 24.6491 21.3644 12.5759 19.6515 42.9704 25.2661 1.6809 3.8952 10.0466 7.0693 3.7148 23.9948 19.1063 2.3827 9.7120 23.6311 5.6317 54.7391 12.5621 9.0104 22.2510 10.9908 127.7877 148.3055 549.8696 589.7389 39.6256 25.7907 60.2361 12.4869 5.5800 30.3909 12.6738 5.5723 18.1198 27.0712
temp: 298.150 k
press: 1.00000 atm
elementType: 8 8 7 7 6 6 6 6 6 6 6 6 6 1 1 1 1 1 1 1 1 1 1 1 1 1 1
symmnumber: 1
zpe: 584029.7 jmol-1
zpe.correction: 0.222445 hartree
zpe.thermalcorrener: 0.235375 hartree
zpe.thermalcorrenthalpy: 0.236319 hartree
zpe.thermalcorrgfe: 0.182826 hartree
zpe.sumelectzpe: -610.264002 hartree
zpe.sumelectthermal: -610.251072 hartree
zpe.sumelectthermalent: -610.250128 hartree
zpe.sumelectthermalfe: -610.303621 hartree
dipole: 4.9549 3.4688 -1.6282
dipole: 6.2638
quadrupole: -62.4420 -78.1783 -80.6815
quadrupole: -3.4831 0.3226 3.5026
quadrupole: 11.3253 -4.4111 -6.9142 -3.4831 0.3226 3.5026
hfenergy: -610.4864468 hartree
pointgroup: C01 [X(C9H14N2O2)]
dipole: 2.108705 -0.7678006 1.0182981 debye
polarizability: 149.5718921|8.583436|128.6453299|4.7225265|-16.8487509|80.058161 unknown
InChI: InChI=1S/C9H14N2O2/c1-11(5-6-12)7-8-9(13)3-2-4-10-8/h2-4,12-13H,5-7H2,1H3
charge 0 multiplicity 1
27 atoms
O  -2.315108 1.578722 -1.19593
O  1.882305 -1.835996 0.484575
N  -1.583528 -0.851652 0.660889
N  0.351261 1.259971 -0.754114
C  -0.684946 -0.969898 -0.519233
C  -2.92596 -0.294335 0.376335
C  0.519517 -0.04456 -0.389159
C  -1.576785 -2.035973 1.538847
C  -2.929027 1.223157 0.076908
C  1.773021 -0.483338 0.124674
C  2.841341 0.432831 0.252168
C  1.37146 2.153651 -0.626649
C  2.63668 1.777677 -0.128894
H  -1.235942 -0.687902 -1.436167
H  -0.330706 -2.011619 -0.630311
H  -3.551545 -0.460837 1.276094
H  -3.423795 -0.820823 -0.475783
H  -2.092302 -1.800108 2.487742
H  -0.535306 -2.31454 1.776734
H  -2.075792 -2.931729 1.089531
H  -2.442093 1.748524 0.927592
H  -3.981165 1.561004 0.01224
H  3.814859 0.107381 0.641188
H  1.159087 3.181404 -0.936046
H  3.441073 2.513927 -0.042083
H  -1.29771 1.564996 -1.098178
H  2.792705 -2.047333 0.810731
