program: Gaussian 09
title: 000258762
version: EM64L-G09RevD.01
frameworkgroup: C1[X(C12H12N2O2)]
method: RPBEPBE
basis: SDD
operation: Freq
keyword: #p
keyword: freq=noraman
keyword: PBEPBE/SDD
title: #p freq=noraman PBEPBE/SDD
converged: NO YES NO NO
title: Mulliken charges:
elementType: O O N N C C C C C C C C C C C C H H H H H H H H H H H H
charge: -0.264974 -0.270673 -0.423734 -0.074787 -0.236337 0.542414 0.398494 -0.602535 -0.515200 0.361107 -0.333354 -0.180022 -0.386110 0.203773 -0.790801 -0.535550 0.258281 0.328673 0.248831 0.353261 0.229456 0.243275 0.239539 0.261757 0.239546 0.243121 0.231275 0.231274
chargesum: 0.00000
title: Mulliken charges with hydrogens summed into heavy atoms:
elementType: O O N N C C C C C C C C C C C C
charge: -0.264974 -0.270673 -0.070473 -0.074787 -0.236337 0.542414 0.398494 -0.344254 -0.186527 0.361107 -0.084523 0.049434 -0.142834 0.203773 -0.049959 0.170119
polarizability: 2.23341503e+02 1.70489660e+01 1.98546172e+02 -3.72795102e-04 -7.27156765e-04 6.88114176e+01
1716.lowfreq: -69.7979 -11.3076 -2.6760 0.0004 0.0007 0.0009 4.3330 67.6212 79.4645
frequency: -69.7971 67.6090 79.4552 86.1123 108.3082 137.7586 185.3780 194.1267 212.5688 251.9471 268.4110 313.3694 317.5313 359.0412 423.5270 438.1256 508.9687 526.8859 536.1938 571.3244 584.5782 623.5140 632.4855 660.1227 677.9813 771.5434 796.1737 810.6646 852.8649 870.1058 871.0591 912.4196 918.8391 928.2940 932.5368 984.3725 985.5017 1010.9273 1032.8004 1039.2124 1096.9567 1111.0457 1126.8210 1159.4490 1165.0898 1219.3222 1221.4930 1254.8916 1298.6922 1348.9965 1374.4895 1376.8078 1406.3947 1428.1414 1444.5907 1454.6663 1459.4350 1465.1404 1468.5895 1469.1279 1475.2610 1527.9404 1567.5948 1588.2089 1614.1600 1631.1412 2972.3827 2990.4917 3064.7487 3076.1668 3129.1688 3129.8853 3137.3016 3137.4260 3160.6337 3169.1988 3192.2550 3375.7490
redmass: 1.0397 4.6138 3.5594 4.4747 4.4505 4.2772 4.3948 3.7773 1.4458 6.9115 2.4541 4.2076 3.7273 4.9155 6.2742 3.7931 4.8404 5.5697 4.0424 3.1379 4.8200 6.6086 3.8243 2.6647 5.9945 5.7066 1.3029 3.3816 1.1281 5.8359 1.7225 1.5027 4.4687 5.8426 1.4847 1.9636 1.3721 3.5504 1.6726 2.3422 2.9656 1.2566 1.8228 1.3624 1.6873 1.5063 1.8754 2.0933 4.1711 2.5807 1.2693 2.1090 2.7858 2.3312 1.4208 1.6403 2.5708 1.0468 1.0488 2.3321 1.2110 2.6572 6.6008 6.2992 5.7776 6.5397 1.0322 1.0379 1.1044 1.0982 1.1005 1.0879 1.0917 1.0986 1.0923 1.0992 1.0918 1.0768
irintensity: 0.3256 4.0558 7.3588 1.1936 7.0367 5.7075 2.1841 4.9169 0.0324 0.9599 0.0002 5.1093 0.9100 0.9372 1.1941 2.8537 6.3696 25.1649 0.3322 0.0346 10.5717 5.9517 3.6573 0.2557 3.5939 2.6193 36.4222 20.1184 59.2933 8.0456 35.4415 53.9827 21.6303 1.7176 5.8470 30.7326 1.3589 35.0969 9.1758 8.0112 6.1265 0.1488 56.4580 18.5500 85.4081 2.1008 16.6462 86.4714 68.2525 48.2732 46.2128 8.8729 9.1896 182.0109 100.2416 6.8434 132.0497 19.1379 13.2437 64.1608 69.2040 488.7202 114.5740 28.6944 117.4918 173.9723 61.4022 6.5716 38.9874 14.0680 29.2629 3.8879 16.0490 9.3924 4.0119 31.8651 7.8066 95.3775
temp: 298.150 k
press: 1.00000 atm
elementType: 8 8 7 7 6 6 6 6 6 6 6 6 6 6 6 6 1 1 1 1 1 1 1 1 1 1 1 1
symmnumber: 1
zpe: 572846.7 jmol-1
zpe.correction: 0.218186 hartree
zpe.thermalcorrener: 0.231666 hartree
zpe.thermalcorrenthalpy: 0.232610 hartree
zpe.thermalcorrgfe: 0.177919 hartree
zpe.sumelectzpe: -723.304100 hartree
zpe.sumelectthermal: -723.290620 hartree
zpe.sumelectthermalent: -723.289676 hartree
zpe.sumelectthermalfe: -723.344368 hartree
dipole: -1.8748 -1.0530 0.0002
dipole: 2.1503
quadrupole: -86.7200 -80.2354 -96.6889
quadrupole: 2.3525 0.0003 0.0004
quadrupole: 1.1614 7.6460 -8.8074 2.3525 0.0003 0.0004
hfenergy: -723.5222862 hartree
pointgroup: C01 [X(C12H12N2O2)]
dipole: -0.7637573 -0.3638264 0.0005468 debye
polarizability: 225.5140122|15.2340923|196.3736116|-0.0857706|-0.0295486|68.8114681 unknown
InChI: InChI=1S/C12H12N2O2/c1-8(15)14-11-7-10(16-2)6-9-4-3-5-13-12(9)11/h3-7,14H,1-2H3
charge 0 multiplicity 1
28 atoms
O  0.797338 3.354755 -0.000928
O  3.445871 -0.860606 -0.001653
N  1.222265 -1.598307 -0.000315
N  -1.438967 -1.794327 0.001134
C  -0.918948 -0.511097 0.000627
C  -1.738131 0.678254 0.000852
C  0.52019 -0.378438 -0.000161
C  -1.122302 1.961288 0.000304
C  1.113343 0.892249 -0.000693
C  0.277992 2.05483 -0.000447
C  -3.160199 0.475402 0.001649
C  -3.677392 -0.821833 0.00216
C  -2.778158 -1.936042 0.001878
C  2.598767 -1.805865 -0.001017
C  3.00319 -3.278682 -0.000982
C  2.256846 3.519166 -0.001628
H  -1.721884 2.876449 0.000467
H  2.202471 0.954676 -0.001276
H  -3.82581 1.345995 0.00185
H  0.575767 -2.404207 0.000178
H  -4.756754 -1.001939 0.002771
H  -3.163827 -2.961762 0.002268
H  2.611543 -3.797655 0.893172
H  4.100416 -3.344445 -0.001469
H  2.610742 -3.797912 -0.894636
H  2.417631 4.60708 -0.001854
H  2.711734 3.072062 -0.905396
H  2.712565 3.072312 0.901845
