program: Gaussian 09
title: 000258755
version: EM64L-G09RevD.01
frameworkgroup: C1[X(C12H11N3)]
method: RPBEPBE
basis: SDD
operation: Freq
keyword: #pfreq=noraman
keyword: PBEPBE/SDD
title: #p freq=noraman PBEPBE/SDD
converged: NO NO NO NO
title: Mulliken charges:
elementType: N N N C C C C C C C C C C C C H H H H H H H H H H H
charge: -0.436430 0.025331 -0.004601 0.477561 -0.416372 -0.364216 0.424816 -0.191087 -0.191263 -0.263147 -0.304934 -0.403294 -0.440234 -0.183699 -0.335481 0.216293 0.269659 0.271509 0.224402 0.226240 0.228781 0.229975 0.199765 0.269254 0.230000 0.241174
chargesum: 0.00000
title: Mulliken charges with hydrogens summed into heavy atoms:
elementType: N N N C C C C C C C C C C C C
charge: -0.164921 0.025331 -0.004601 0.477561 -0.200079 -0.094557 0.424816 0.033314 0.034977 -0.034367 -0.074959 -0.203529 -0.170980 0.046301 -0.094307
polarizability: 3.50367870e+02 -2.99941748e+00 1.50655531e+02 -3.92416979e-03 -1.54621528e-02 5.75881094e+01
1716.lowfreq: -0.0010 0.0008 0.0013 4.0972 6.7338 17.3624 36.4820 48.7815 55.9140
frequency: 36.4600 48.7769 55.9080 115.9653 173.4643 220.6988 231.6799 252.8603 289.3687 375.6062 400.9001 409.3049 492.3622 504.0472 510.5492 607.7518 608.9477 614.4837 630.2351 655.1612 695.6296 716.3290 761.2104 808.4690 808.8403 833.6850 885.5281 899.6724 901.9053 920.3138 945.0231 967.1041 981.6466 981.7037 989.9840 998.4295 1018.6865 1026.8537 1076.0586 1111.0790 1136.6117 1169.9346 1177.7648 1196.7996 1233.3639 1273.8826 1296.8140 1313.6884 1330.0797 1350.1890 1391.0813 1413.2615 1439.7348 1454.6484 1482.8206 1528.4579 1538.4078 1576.7061 1585.4409 1604.2874 1612.9530 2962.0182 3108.0025 3117.0507 3129.7668 3134.7114 3141.6612 3152.5656 3162.1258 3162.8329 3182.6996 3379.0439
redmass: 4.1762 4.6075 5.4734 4.7402 5.0229 2.4623 5.0657 6.2587 3.7477 5.1436 3.2449 2.9123 6.5739 3.5142 2.9905 7.1889 1.2737 6.7342 6.5633 6.2051 1.9390 1.8458 1.7042 1.6440 5.8261 1.2575 4.4382 1.4677 1.4479 1.3592 1.5693 1.3555 1.3879 6.1006 1.3106 3.6745 2.1413 2.9899 1.7395 1.8342 2.8665 1.0591 1.1092 1.3149 2.0008 2.2908 1.9614 2.8383 1.3113 1.5598 5.4336 2.1811 2.1722 2.3691 2.2742 2.2543 4.6293 5.7391 6.2353 4.6064 6.0175 1.0862 1.0883 1.0892 1.0866 1.0897 1.0930 1.0918 1.0988 1.0999 1.0955 1.0743
irintensity: 1.4362 0.1970 0.0965 0.5847 2.6876 29.0203 1.3167 0.4421 1.2170 12.3328 3.6957 0.0096 2.1739 11.2911 10.2001 4.9317 54.8944 1.6519 25.6374 2.1923 48.5562 35.4123 87.1116 26.5463 1.2732 0.0328 2.6450 44.8658 0.6543 1.7335 11.7195 0.0052 1.5068 2.0235 1.4120 4.7916 2.5095 5.0398 27.9834 34.3499 118.5716 0.8652 6.0501 1.0206 9.4109 175.9974 11.5240 0.8517 2.5992 21.7962 17.1318 42.6398 18.4790 8.2221 124.9173 86.6431 145.1264 198.6877 81.1243 6.5066 135.7595 61.2181 14.9274 10.0646 0.2570 11.7675 29.1766 17.2014 42.7424 26.9411 3.2274 1.6803
temp: 298.150 k
press: 1.00000 atm
elementType: 7 7 7 6 6 6 6 6 6 6 6 6 6 6 6 1 1 1 1 1 1 1 1 1 1 1
symmnumber: 1
zpe: 534145.1 jmol-1
zpe.correction: 0.203445 hartree
zpe.thermalcorrener: 0.215722 hartree
zpe.thermalcorrenthalpy: 0.216666 hartree
zpe.thermalcorrgfe: 0.163415 hartree
zpe.sumelectzpe: -627.047594 hartree
zpe.sumelectthermal: -627.035318 hartree
zpe.sumelectthermalent: -627.034374 hartree
zpe.sumelectthermalfe: -627.087624 hartree
dipole: -0.8822 -4.5252 0.0016
dipole: 4.6104
quadrupole: -76.0038 -79.1505 -94.6244
quadrupole: -8.7789 0.0017 -0.0026
quadrupole: 7.2558 4.1090 -11.3648 -8.7789 0.0017 -0.0026
hfenergy: -627.2510393 hartree
pointgroup: C01 [X(C12H11N3)]
dipole: -0.351866 1.7794214 -0.0006323 debye
dipolederiv: -2.2879165 -0.298664 0.0000119 0.6983941 0.0625561 -0.0002463 0.0000779 -0.0003082 -0.2863309 1.8531943 0.0241109 -0.0000913 -0.725901 -0.3212692 0.0000746 -0.0001016 0.0000487 -0.0810803 -0.2783083 0.0311631 -0.0000057 -0.0109277 -0.3053185 0.0000178 0.0000068 0.0000149 -0.2437249 1.6539886 0.3961807 0.0001129 0.9501988 0.1979725 0.0000938 0.0000154 0.0000999 0.0993624 -0.5668601 -0.1585813 0.0000036 0.0376506 0.0617033 -0.0000223 -0.000063 -0.0000579 -0.2228104 -0.172231 -0.0187413 -0.0000089 -0.4558835 -0.1482315 -0.0000284 0.0000204 0.0000019 -0.1852617 0.7703387 -0.0921622 0.0000149 -0.4587297 -0.2186988 0.0000831 0.0000509 0.0000646 0.0805223 0.2510992 0.0376267 0.0000278 -0.0297715 0.1341281 -0.0000301 0.0000519 -0.000022 -0.1341284 0.0858495 -0.0480041 0.0000332 0.1218671 0.1757277 -0.0000218 0.000028 -0.0000289 -0.1337459 -0.1658932 0.0802321 -0.000004 -0.0521757 -0.1649176 -0.0000016 -0.0000045 -0.0000066 -0.2033945 -0.2645981 0.0144153 -0.0000174 -0.0109193 0.1593141 -0.0000779 0.0000166 -0.0000763 -0.1637063 -0.916525 -0.0135933 -0.0000009 -0.5498318 0.4465472 -0.0001261 0.0001191 -0.0001267 -0.1580898 -0.0027589 -0.0012042 -0.0000161 0.3715051 0.1631441 -0.0000773 -0.0000919 -0.0000621 -0.0717494 0.1212286 0.065962 -0.0000243 0.2221143 -0.1071242 -0.0000119 -0.0000711 -0.0000033 -0.1048199 0.067909 -0.0285547 -0.0000162 -0.0977656 0.1493925 -0.0000518 0.0000051 -0.0000611 -0.1011606 0.0953744 -0.0577433 -0.0000009 -0.0225534 -0.127061 0.0000297 -0.0000186 0.0000325 0.1714063 0.0346029 0.0770555 -0.0000151 0.1025442 0.0686741 0.0000084 -0.0000223 0.0000079 0.1700408 -0.0011727 -0.0017249 -0.0000123 -0.0032321 -0.0087741 0.0001098 -0.0000932 0.0001781 0.3207352 -0.0988125 0.0938486 -0.0000284 0.1201839 0.0230433 0.0000234 -0.0000316 0.0000275 0.156115 0.0738927 -0.0036818 -0.000005 -0.0534924 -0.1211607 0.0000225 0.0000032 0.0000241 0.1524375 -0.1050562 -0.0866565 -0.0000102 -0.0982204 0.0431118 0.0000057 -0.0000137 0.0000082 0.1736875 0.1067256 0.0486557 -0.0000061 0.0068602 -0.1082928 0.0000653 0.0000005 0.0000585 0.1490717 -0.0303742 0.0291319 -0.0000041 0.0500587 -0.2077241 0.0000854 0.0000355 0.0001113 0.1820084 -0.0107736 -0.0653802 0.0000283 -0.0830113 0.0612717 0.0000194 0.0000364 0.0000197 0.1274685 -0.0991166 -0.0871361 0.0000355 -0.122426 0.0390155 0.0000384 0.0000475 0.0000366 0.1610061 -0.1138065 0.0634455 -0.0000011 0.0934643 0.0529704 0.0000182 -0.0000039 0.0000185 0.1461414 unknown
polarizability: 350.3503732|3.534191|150.6730273|0.0039656|-0.0154516|57.5881094 unknown
InChI: InChI=1S/C12H11N3/c1-2-6-12(7-3-1)15-14-10-11-5-4-8-13-9-11/h1-10,15H
charge 0 multiplicity 1
26 atoms
N  -1.183004 1.101643 0.000182
N  -0.004058 0.421408 0.000205
N  3.760238 -1.628939 0.000567
C  -2.423432 0.421975 0.000043
C  -3.617091 1.192695 -0.000136
C  -2.48949 -0.995456 0.000167
C  2.425031 0.439046 0.000118
C  -4.8704 0.544377 -0.000185
C  -3.750965 -1.627516 0.000119
C  -4.947494 -0.869223 -0.000045
C  3.622643 1.208058 -0.00016
C  1.12248 1.109823 0.000036
C  2.562539 -0.983594 0.000473
C  4.871506 0.551495 -0.00007
C  4.895905 -0.863225 0.000297
H  -3.565431 2.289833 -0.000245
H  -1.561647 -1.572648 0.000264
H  -1.19709 2.133011 -0.000271
H  -5.787107 1.145155 -0.000333
H  -3.79905 -2.722604 0.000206
H  -5.921422 -1.370382 -0.000069
H  3.571662 2.304461 -0.000435
H  1.133797 2.219919 -0.000223
H  1.667397 -1.61341 0.000697
H  5.807544 1.119701 -0.000275
H  5.843738 -1.4130 0.000374
