program: Gaussian 09
title: 000258747
version: EM64L-G09RevD.01
frameworkgroup: C1[X(C12H12N2O2)]
method: RPBEPBE
basis: SDD
operation: Freq
keyword: #p
keyword: freq=noraman
keyword: PBEPBE/SDD
title: #p freq=noraman PBEPBE/SDD
converged: NO NO NO NO
title: Mulliken charges:
elementType: O O N N C C C C C C C C C C C C H H H H H H H H H H H H
charge: -0.224230 -0.224020 -0.470703 0.012997 0.149779 0.195766 -0.506000 -0.503905 -0.412424 -0.400189 0.180081 0.213500 -0.567665 -0.321093 0.390001 -0.384779 0.226418 0.222337 0.223973 0.230716 0.209541 0.211949 0.215335 0.211946 0.306580 0.290872 0.239696 0.283518
chargesum: 0.00000
title: Mulliken charges with hydrogens summed into heavy atoms:
elementType: O O N N C C C C C C C C C C C C
charge: -0.224230 -0.224020 -0.164122 0.012997 0.149779 0.195766 -0.057245 -0.049216 0.009067 0.027093 0.180081 0.213500 -0.276793 -0.081396 0.390001 -0.101261
polarizability: 2.48506779e+02 -6.92972090e+00 1.57838830e+02 3.39398566e-01 -1.14902673e+00 7.49465137e+01
1716.lowfreq: -15.2265 -10.4473 -0.0005 0.0003 0.0005 3.2848 59.9569 71.2754 95.5315
frequency: 59.8332 71.1575 95.5260 127.2325 172.2004 185.2169 250.5725 284.7272 312.1966 321.3843 340.1325 410.3570 431.6297 456.3896 479.4334 536.2844 539.3374 557.9936 567.7318 631.9413 639.4575 668.7637 703.4919 719.1975 759.2893 790.3893 819.8108 822.5785 824.7439 859.5261 904.5768 907.0597 932.1769 963.1787 964.8551 994.2031 1064.2454 1079.4060 1089.0034 1126.4137 1133.5306 1150.3140 1154.4937 1204.0406 1214.0595 1233.5991 1236.9446 1253.8689 1282.0850 1291.9722 1331.0270 1335.6019 1339.8292 1353.1128 1362.1365 1420.3922 1434.7452 1457.5670 1464.7449 1468.6992 1473.0360 1476.4806 1492.2628 1579.8263 1596.4988 1632.8807 2956.3076 2963.2088 2983.6813 2988.0745 3009.4636 3017.6762 3050.3355 3058.0933 3145.6097 3178.1950 3190.0827 3598.5941
redmass: 6.1696 5.1566 3.4758 6.1989 3.4030 3.0094 6.3620 2.3029 5.4033 3.1885 3.6542 4.7539 2.9116 4.0665 3.3921 2.6993 1.6451 3.9128 3.6259 4.3021 4.1419 3.8114 5.5237 5.6007 4.2198 6.7695 1.7077 2.1722 1.8524 2.6380 1.6830 2.5669 1.4937 1.3248 2.2490 2.8995 2.5443 1.8739 2.0819 1.3794 1.1447 1.9657 2.0526 2.3541 2.5959 1.8211 1.3433 1.3228 1.4993 2.2266 1.9292 1.4821 1.4216 3.0128 3.2311 2.9917 3.2847 1.1518 1.1223 1.1808 1.7816 1.7206 6.0568 7.4343 6.8252 6.8107 1.0609 1.0631 1.0655 1.0666 1.0926 1.0954 1.0987 1.1042 1.0908 1.0925 1.0944 1.0804
irintensity: 0.0107 0.0207 0.8110 0.9858 0.3003 3.5375 0.9342 1.3746 0.3426 1.8912 1.9552 0.6951 6.9805 1.8912 1.9835 23.5492 53.1828 6.9509 10.5821 5.3442 11.8552 0.1713 26.6905 14.3100 0.0273 3.8915 26.7994 19.8337 2.1677 4.0780 4.8644 2.5577 20.7254 1.3739 4.7349 3.7107 22.4643 0.4185 1.6013 38.0819 2.8450 14.0483 7.7219 191.5855 298.5501 9.6068 0.2806 6.1847 5.3666 22.8251 25.8525 2.4490 13.7658 77.9292 81.6752 19.5202 32.7508 1.1148 11.3293 10.9437 19.4704 1.6613 32.1431 8.2815 2.7388 37.9967 46.6707 28.7022 31.9762 19.3934 47.8315 24.1136 72.2467 57.2332 10.4798 1.6510 4.7296 64.8833
temp: 298.150 k
press: 1.00000 atm
elementType: 8 8 7 7 6 6 6 6 6 6 6 6 6 6 6 6 1 1 1 1 1 1 1 1 1 1 1 1
symmnumber: 1
zpe: 580049.6 jmol-1
zpe.correction: 0.220929 hartree
zpe.thermalcorrener: 0.233638 hartree
zpe.thermalcorrenthalpy: 0.234582 hartree
zpe.thermalcorrgfe: 0.181630 hartree
zpe.sumelectzpe: -723.228612 hartree
zpe.sumelectthermal: -723.215904 hartree
zpe.sumelectthermalent: -723.214960 hartree
zpe.sumelectthermalfe: -723.267912 hartree
dipole: -8.3467 3.8642 -0.0823
dipole: 9.1982
quadrupole: -109.9836 -82.7899 -94.6806
quadrupole: 6.1376 -0.1811 -0.2138
quadrupole: -14.1655 13.0281 1.1374 6.1376 -0.1811 -0.2138
hfenergy: -723.4495415 hartree
pointgroup: C01 [X(C12H12N2O2)]
dipole: -3.2914108 -1.5034725 0.0465894 debye
polarizability: 248.5726193|6.4659312|157.755913|-0.6932934|-1.6148578|74.9635904 unknown
InChI: InChI=1S/C12H12N2O2/c15-14(16)8-5-6-12-10(7-8)9-3-1-2-4-11(9)13-12/h5-7,13H,1-4H2
charge 0 multiplicity 1
28 atoms
O  4.720361 0.079119 -0.022473
O  3.582813 2.058245 -0.065575
N  -1.353545 -1.844852 0.04812
N  3.619747 0.763138 -0.033019
C  -1.470219 0.438194 -0.008747
C  -2.223856 -0.733652 0.024158
C  -2.098416 1.810942 -0.035672
C  -3.725119 -0.823242 0.033013
C  -3.599436 1.72227 0.354818
C  -4.316981 0.556031 -0.373075
C  -0.07377 0.045867 -0.005223
C  -0.033181 -1.401169 0.030153
C  1.139989 0.766822 -0.025399
C  1.180286 -2.124786 0.042659
C  2.339623 0.025984 -0.011818
C  2.38175 -1.397643 0.02143
H  -1.569633 2.495972 0.655382
H  -2.001393 2.256368 -1.04737
H  -4.083783 -1.610086 -0.660775
H  -4.089075 -1.102584 1.04384
H  -3.684523 1.571108 1.449545
H  -4.102697 2.678236 0.118991
H  -4.209467 0.690018 -1.467332
H  -5.39884 0.57242 -0.145628
H  -1.65052 -2.818734 0.068884
H  1.180205 1.85871 -0.05282
H  1.19608 -3.219223 0.069473
H  3.354098 -1.895172 0.030158
