program: Gaussian 09
title: 000258744
version: EM64L-G09RevD.01
frameworkgroup: C1[X(C12H5Br4N)]
method: RPBEPBE
basis: SDD
operation: Freq
keyword: #p
keyword: freq=noraman
keyword: PBEPBE/SDD
title: #p freq=noraman PBEPBE/SDD
converged: YES YES YES YES
title: Mulliken charges:
elementType: Br Br Br Br N C C C C C C C C C C C C H H H H H
charge: 0.030815 0.030815 0.021620 0.021620 -0.461929 0.222098 0.222097 0.375981 0.375981 -0.341521 -0.341520 -0.362168 -0.362169 -0.243182 -0.243181 -0.174048 -0.174047 0.342082 0.262089 0.262089 0.268239 0.268238
chargesum: 0.00000
title: Mulliken charges with hydrogens summed into heavy atoms:
elementType: Br Br Br Br N C C C C C C C C C C C C
charge: 0.030815 0.030815 0.021620 0.021620 -0.119847 0.222098 0.222097 0.375981 0.375981 -0.079431 -0.079431 -0.362168 -0.362169 -0.243182 -0.243181 0.094191 0.094191
polarizability: 3.23170469e+02 -2.07983268e-02 2.68474134e+02 -1.47608117e-03 -1.15261648e-02 6.47006882e+01
1716.lowfreq: -3.4445 -2.5239 -0.0005 -0.0001 0.0004 4.1979 27.9744 52.0826 61.1968
frequency: 27.9715 52.0773 61.1968 88.6594 118.8301 119.7491 141.7756 147.4636 170.3475 200.1398 235.5392 267.2273 306.8218 325.6163 326.1519 348.3261 373.5454 489.0544 525.0133 528.1038 569.0017 573.6215 584.0475 591.5756 625.6293 684.8553 721.0202 733.2905 764.4053 825.9159 844.9665 860.3600 861.2073 879.3798 882.2338 889.7523 1028.4318 1070.0278 1075.8043 1174.5325 1181.1650 1241.1284 1253.9006 1285.5905 1307.4460 1365.7215 1377.5101 1410.1126 1427.2717 1444.3927 1473.3163 1550.1803 1561.9102 1614.6786 1634.0249 3172.1467 3173.7361 3183.1802 3183.2389 3588.2205
redmass: 64.4854 12.5341 40.8729 71.4892 27.8440 9.7551 30.9225 5.9808 5.4317 52.4086 4.0788 15.9698 12.3115 7.8690 7.4408 6.0767 7.3500 5.3649 4.7222 7.5033 2.9164 1.1996 4.2545 4.9199 9.0876 10.2663 9.2016 7.0540 4.5926 6.7861 4.5899 1.4518 1.4237 8.6579 1.3738 1.5931 5.4455 2.0813 2.1108 3.6081 1.6540 1.6566 1.8566 2.4823 2.3413 7.1995 2.1724 6.6529 4.9739 6.6308 5.0582 7.5234 8.3797 8.1428 10.0355 1.0931 1.0931 1.0930 1.0930 1.0804
irintensity: 0.0000 0.0032 0.0052 0.0002 0.1247 0.0000 0.2288 0.0083 0.0054 0.0143 0.0000 6.8336 3.5402 1.3125 0.0000 0.2362 0.1099 0.8015 0.0000 24.1972 0.1769 137.4862 0.0000 1.3781 37.2133 0.0029 103.5831 17.2979 0.0000 27.7114 12.9487 0.0003 44.6591 1.4510 23.2911 0.0000 108.9781 10.3482 30.9709 7.9763 65.1701 4.9073 2.8803 0.5041 196.0927 8.7951 2.8023 12.2843 86.1301 23.0808 220.1113 0.0100 157.5517 2.9775 0.1297 0.0221 0.5629 1.8180 0.0313 75.9601
temp: 298.150 k
press: 1.00000 atm
elementType: 35 35 35 35 7 6 6 6 6 6 6 6 6 6 6 6 6 1 1 1 1 1
symmnumber: 1
zpe: 350042.5 jmol-1
zpe.correction: 0.133324 hartree
zpe.thermalcorrener: 0.148722 hartree
zpe.thermalcorrenthalpy: 0.149666 hartree
zpe.thermalcorrgfe: 0.086432 hartree
zpe.sumelectzpe: -567.736010 hartree
zpe.sumelectthermal: -567.720613 hartree
zpe.sumelectthermalent: -567.719669 hartree
zpe.sumelectthermalfe: -567.782903 hartree
dipole: 0.0000 1.1933 -0.0001
dipole: 1.1933
quadrupole: -140.5611 -129.4432 -140.1401
quadrupole: 0.0000 0.0000 -0.0008
quadrupole: -3.8463 7.2716 -3.4253 0.0000 0.0000 -0.0008
hfenergy: -567.8693345 hartree
pointgroup: C01 [X(C12H5Br4N1)]
dipole: -0.0000008 0.4694937 -0.0000231 debye
dipolederiv: -0.1503929 0.1321971 -0.0001057 0.2467726 -0.609564 -0.0000538 -0.0000631 0.0001792 -0.0058985 -0.1504513 -0.1320421 0.0000803 -0.2467985 -0.6097098 0.0000097 -0.0000075 0.0002028 -0.0059 -0.4586662 -0.3172345 0.0002242 -0.4101452 -0.3890654 -0.0001211 0.0000584 0.0001231 -0.0236894 -0.458473 0.3170321 -0.0001369 0.4101358 -0.3896599 0.0000037 -0.0000732 0.0000696 -0.0236772 -1.2389789 -0.0001671 0.0000648 -0.0000335 -0.4920083 0.00006 0.0000426 -0.0000465 -0.284608 0.1627148 0.2324828 -0.0000516 -0.3476518 0.0187156 0.0001238 0.0000307 0.0000395 -0.0007045 0.1629221 -0.2322565 0.0000143 0.3476257 0.0185634 0.0000592 -0.0000486 0.0000172 -0.0006963 0.439844 0.3539456 -0.0001597 1.0853433 -0.1464219 -0.0001749 -0.0001299 0.0000618 0.107735 0.4398733 -0.353665 0.0000497 -1.0851703 -0.1465924 -0.0000745 0.0000789 0.0001316 0.1077289 -0.1242603 -0.2273833 -0.0000886 -0.0872479 -0.1695991 0.0000167 0.0000219 0.0000461 -0.0868936 -0.1245326 0.2275444 0.0000419 0.0870884 -0.1694773 -0.0000353 -0.000033 0.0000593 -0.0869023 0.2561935 -0.401642 0.0001871 -0.5499605 1.0720033 0.0000978 0.000124 -0.0002371 -0.1511373 0.2562036 0.401389 -0.0001279 0.5499218 1.0722876 0.0000155 -0.0000143 -0.0003117 -0.1511326 0.6425471 0.6369535 -0.0001685 0.8430152 0.6208204 0.0000419 -0.0000922 -0.0002241 -0.1468156 0.6425574 -0.6371976 0.0001233 -0.8430349 0.6213951 -0.0000778 0.0001452 -0.0002147 -0.1468146 -0.3697504 -0.0689049 0.0000299 -0.1834476 -0.3765614 0.0000171 -0.0000072 0.0001272 -0.0378241 -0.3697874 0.0688316 0.00003 0.1836086 -0.3764423 -0.0000212 0.0000038 0.0001021 -0.0378153 0.2093051 0.0000247 -0.0000017 -0.0000855 0.2523503 0.0000233 0.0000056 -0.0000209 0.3350581 0.102735 0.0582363 0.0000111 0.0258612 -0.0090712 -0.0000185 -0.0000193 -0.000026 0.1587297 0.1027519 -0.0582347 0.0000133 -0.0257969 -0.0091264 0.0000616 -0.0000046 -0.0000103 0.1587276 0.0138302 0.0300443 -0.0000187 0.0216 0.1085915 0.0000219 -0.0000041 -0.0000467 0.1612673 0.0138152 -0.0299537 -0.0000107 -0.0216 0.1085725 0.0000252 -0.0000143 -0.0000214 0.1612625 unknown
polarizability: 323.1704689|-0.0206796|268.4741343|-0.0014761|-0.0115262|64.7006882 unknown
InChI: InChI=1S/C12H5Br4N/c13-5-1-7-8-2-6(14)4-10(16)12(8)17-11(7)9(15)3-5/h1-4,17H
charge 0 multiplicity 1
22 atoms
Br -3.025227 3.044838 -0.000245
Br 3.025186 3.044851 -0.000376
Br -4.435074 -2.605927 0.000329
Br 4.435057 -2.605908 0.000137
N  -0.000017 1.630502 -0.000189
C  -0.729491 -0.561674 0.000043
C  0.729466 -0.56167 0.000012
C  -1.13712 0.818274 -0.000078
C  1.137089 0.818279 -0.000128
C  -1.700054 -1.590286 0.000162
C  1.700034 -1.590279 0.00009
C  -2.502826 1.159954 -0.000079
C  2.502793 1.159965 -0.000188
C  -3.05421 -1.21298 0.000159
C  3.054187 -1.212967 0.000028
C  -3.475283 0.144906 0.000041
C  3.475254 0.144921 -0.000108
H  -0.000019 2.65002 -0.00025
H  -1.411735 -2.644536 0.000255
H  1.411718 -2.64453 0.000195
H  -4.538483 0.395962 0.000043
H  4.538454 0.395982 -0.000152
