program: Gaussian 09
title: 000258800
version: EM64L-G09RevD.01
frameworkgroup: C1[X(C12H20Cl2N2O2)]
method: RPBEPBE
basis: SDD
operation: Freq
keyword: #p
keyword: freq=noraman
keyword: PBEPBE/SDD
title: #p freq=noraman PBEPBE/SDD
converged: YES YES NO NO
title: Mulliken charges:
elementType: Cl Cl O O N N C C C C C C C C C C C C H H H H H H H H H H H H H H H H H H H H
charge: -0.083296 -0.081634 -0.281886 -0.276647 -0.356517 -0.363019 -0.170006 -0.171276 -0.435332 -0.467800 -0.448107 -0.443005 0.196239 0.216359 -0.336328 -0.326672 -0.558417 -0.557742 0.238936 0.197050 0.192948 0.248582 0.190956 0.211997 0.201183 0.254224 0.248651 0.205751 0.318208 0.308963 0.266903 0.243169 0.266160 0.244887 0.291175 0.266815 0.280200 0.268328
chargesum: 0.00000
title: Mulliken charges with hydrogens summed into heavy atoms:
elementType: Cl Cl O O N N C C C C C C C C C C C C
charge: -0.083296 -0.081634 -0.281886 -0.276647 -0.038309 -0.054057 0.068931 0.025775 0.006198 -0.064846 0.007301 0.011396 0.196239 0.216359 0.173743 0.184375 -0.000428 -0.009214
polarizability: 1.87575557e+02 -8.83441685e+00 1.57986920e+02 -5.51566935e+00 -1.65915269e+00 1.40316714e+02
1716.lowfreq: -12.2225 -8.9056 -0.0028 -0.0023 -0.0016 2.6404 5.4765 18.4469 27.1197
frequency: -9.6701 13.6314 25.8653 39.1609 45.7333 47.7574 64.0215 93.6485 107.7642 144.4898 156.3597 190.1794 218.1133 229.5289 270.0652 282.1996 286.2556 348.6837 352.3549 367.4323 402.0023 440.8851 455.7736 490.4657 499.4815 539.9957 565.3025 590.4332 591.1863 611.4857 617.4675 703.7457 711.8784 751.4162 789.8055 801.1815 814.0572 834.5999 853.3390 914.2086 915.7194 927.5886 939.8418 979.9546 982.5037 1000.1220 1022.5843 1037.3628 1049.4528 1066.7788 1080.3499 1097.1782 1103.0762 1119.4115 1152.2004 1160.5920 1166.0250 1178.4980 1190.6661 1205.1847 1222.4975 1233.2188 1240.2748 1269.9959 1283.4550 1289.4561 1296.4323 1300.1818 1302.2400 1320.8714 1332.3026 1340.7575 1354.2243 1359.6264 1362.6685 1366.1259 1441.5077 1441.9404 1447.0437 1447.3528 1453.0581 1466.9330 1476.3595 1479.4918 1481.6762 1501.1116 1594.9731 1610.1582 2951.9920 2961.0611 2973.6595 2987.1865 2990.5142 2991.9184 2993.9357 2994.5576 3013.2687 3049.4890 3050.6242 3052.0414 3056.1269 3065.2480 3065.9227 3071.4619 3153.6525 3153.8288 3544.6346 3555.1479
redmass: 9.1975 8.5588 4.7975 9.0585 6.5157 8.3280 7.7201 3.1732 3.4002 3.5070 4.0761 4.2269 4.9475 4.7692 2.5219 3.3632 4.1494 2.5364 2.4456 2.2685 2.7681 2.8875 2.8627 3.2724 2.4455 3.5794 3.5189 2.8302 3.1833 1.3205 1.3992 4.3037 5.7167 3.3405 1.4729 2.3712 2.8479 2.0550 2.3953 2.3004 2.3782 2.4277 1.4853 2.3287 2.3701 2.1008 1.6193 1.8771 1.9285 1.8647 2.1881 1.2349 2.7162 2.5937 1.9929 1.2832 1.3965 1.4523 1.4666 1.5637 1.2629 1.3184 1.4808 1.3305 1.4418 1.4417 1.1944 1.3067 1.3361 1.4317 1.4149 1.3883 1.4055 1.4832 1.3493 1.4501 1.1039 1.1050 1.1294 1.1139 1.0955 1.0921 1.5709 1.1145 1.8428 1.2125 7.2943 6.2729 1.0836 1.0710 1.0683 1.0673 1.0615 1.0591 1.0632 1.0610 1.0980 1.0985 1.1013 1.0961 1.1008 1.0633 1.0610 1.0977 1.1123 1.1120 1.0776 1.0770
irintensity: 0.0957 0.2582 0.2996 1.7730 11.3354 10.1471 4.0173 1.9336 2.6126 3.1353 9.2028 8.4600 4.0191 1.3099 8.2478 3.6364 2.4574 22.4087 10.4464 6.0193 2.0705 6.5750 4.2869 7.2042 1.1750 4.4720 10.8348 26.9613 37.4081 109.0180 85.9776 4.0318 4.2304 6.5152 0.1396 16.1728 9.6445 3.0540 5.1414 7.3155 4.4978 14.0399 3.5767 47.3467 14.0298 10.9940 3.7476 3.4709 2.3471 0.1913 1.9971 1.5027 0.8104 4.0951 8.4378 23.0831 1.9046 3.8435 16.7454 7.0066 31.5873 104.0086 75.7217 4.7763 7.5643 9.0866 38.1693 32.5139 5.9223 9.3215 9.1243 3.9845 1.1946 2.2439 4.0588 8.4327 8.7798 9.3308 32.9853 51.1438 11.5342 20.4504 197.5446 5.6518 245.9487 59.8410 143.0869 131.8466 28.3600 13.2896 47.2934 55.8331 41.7960 44.1207 42.0453 19.9220 48.6887 4.6908 20.6339 6.8421 52.4528 17.9298 23.2170 16.7595 14.7748 13.3058 27.2760 20.0785
temp: 298.150 k
press: 1.00000 atm
elementType: 17 17 8 8 7 7 6 6 6 6 6 6 6 6 6 6 6 6 1 1 1 1 1 1 1 1 1 1 1 1 1 1 1 1 1 1 1 1
symmnumber: 1
zpe: 825598.3 jmol-1
zpe.correction: 0.314454 hartree
zpe.thermalcorrener: 0.333089 hartree
zpe.thermalcorrenthalpy: 0.334034 hartree
zpe.thermalcorrgfe: 0.263687 hartree
zpe.sumelectzpe: -1647.971371 hartree
zpe.sumelectthermal: -1647.952736 hartree
zpe.sumelectthermalent: -1647.951792 hartree
zpe.sumelectthermalfe: -1648.022138 hartree
dipole: -0.7148 0.1710 2.0349
dipole: 2.1635
quadrupole: -120.4749 -128.9449 -120.6739
quadrupole: 4.8528 2.1363 11.2145
quadrupole: 2.8897 -5.5803 2.6907 4.8528 2.1363 11.2145
hfenergy: -1648.2858252 hartree
pointgroup: C01 [X(C12H20Cl2N2O2)]
dipole: -0.2651296 -0.1647148 0.7919055 debye
polarizability: 186.7641712|-7.4886001|157.7584489|-8.972507|4.0154268|141.3565709 unknown
InChI: InChI=1S/C12H20Cl2N2O2/c13-5-7-15-11(17)9-1-2-10(4-3-9)12(18)16-8-6-14/h9-10,15-16H,1-8H2
charge 0 multiplicity 1
38 atoms
Cl 3.838978 -2.905743 -0.276662
Cl -6.280207 0.156745 0.198845
O  2.634669 2.148318 -1.017657
O  -1.355633 -1.372801 -0.933809
N  3.323187 0.244804 0.111763
N  -3.191826 -0.747435 0.3505
C  1.633636 1.739308 1.198153
C  -0.997733 0.294209 0.838158
C  0.365758 2.470165 0.679358
C  1.216562 0.547535 2.102139
C  -0.588383 1.502465 -0.05543
C  0.258539 -0.434574 1.387637
C  2.553594 1.392208 0.001445
C  -1.846261 -0.680945 0.013006
C  4.214859 -0.198496 -0.963126
C  -4.142162 -1.586319 -0.384074
C  3.769426 -1.521852 -1.584548
C  -5.229535 -0.775549 -1.086922
H  2.217493 2.458572 1.811051
H  -1.592542 0.677388 1.695521
H  -0.15342 2.934929 1.541957
H  0.673251 3.277128 -0.007657
H  2.095191 0.003555 2.505327
H  0.705964 0.970131 2.991155
H  -1.493234 2.048031 -0.386246
H  -0.094364 1.116948 -0.96715
H  0.760581 -0.933427 0.537569
H  -0.048368 -1.234458 2.088709
H  3.204763 -0.377241 0.912604
H  -3.557488 -0.156988 1.100417
H  4.185533 0.591069 -1.738798
H  5.254441 -0.286886 -0.595474
H  -3.550486 -2.131296 -1.145524
H  -4.606455 -2.330919 0.289802
H  2.723344 -1.500569 -1.922131
H  4.445763 -1.853605 -2.386075
H  -4.817118 0.005041 -1.741954
H  -5.942316 -1.417045 -1.625785
