program: Gaussian 09
title: 000258748
version: EM64L-G09RevD.01
frameworkgroup: C1[X(C14H9Br2NO)]
method: RPBEPBE
basis: SDD
operation: Freq
keyword: #p
keyword: freq=noraman
keyword: PBEPBE/SDD
title: #p freq=noraman PBEPBE/SDD
converged: YES YES NO NO
title: Mulliken charges:
elementType: Br Br O N C C C C C C C C C C C C C C H H H H H H H H H
charge: 0.008595 0.014858 -0.242381 -0.276558 0.171239 0.184485 0.234208 0.220023 -0.322303 -0.331125 -0.302918 -0.261824 0.207047 -0.242023 -0.237085 -0.171070 -0.213015 -0.793965 0.259279 0.262007 0.316212 0.252708 0.252080 0.250378 0.271034 0.245036 0.245077
chargesum: 0.00000
title: Mulliken charges with hydrogens summed into heavy atoms:
elementType: Br Br O N C C C C C C C C C C C C C C
charge: 0.008595 0.014858 -0.242381 -0.276558 0.171239 0.184485 0.234208 0.220023 -0.063023 -0.069119 0.013294 -0.009116 0.207047 -0.242023 -0.237085 0.081010 0.037363 -0.032817
polarizability: 3.06455447e+02 2.31587347e+00 2.47451629e+02 -2.21692820e-02 2.36093866e-02 7.15398781e+01
1716.lowfreq: -2.4523 -0.0003 -0.0001 0.0003 1.2373 2.9222 48.6911 56.7671 70.4147
frequency: 48.6429 56.7647 70.4145 72.3518 89.0660 158.8085 188.1016 198.9626 206.9732 220.7618 273.9711 286.8338 300.3201 332.3204 365.2350 396.5414 418.7055 427.1490 455.9528 481.6885 549.6678 564.9995 594.0301 597.4309 602.5032 632.1652 669.3790 707.2320 737.7193 773.4412 805.3239 805.8722 836.2456 873.3480 884.0281 893.9539 947.1745 961.0909 981.0157 1002.5861 1013.7805 1039.3862 1057.5370 1068.3154 1129.0821 1146.9695 1195.6981 1213.0232 1243.8974 1269.6239 1281.2609 1314.4990 1375.2809 1386.3410 1398.1839 1406.3438 1423.4929 1451.3881 1462.6948 1475.5835 1476.0112 1574.9664 1582.2810 1594.6484 1613.3516 1620.1971 2996.4970 3088.1044 3135.2382 3166.2674 3168.3754 3169.4814 3170.9534 3216.1131 3218.1498
redmass: 3.5836 9.1474 5.3846 31.1697 5.2775 7.6089 7.3204 11.7991 4.4660 16.9665 1.1189 5.6874 5.6432 4.9155 3.9308 6.3784 8.0304 3.2891 2.9882 6.6317 3.3293 5.1672 4.2949 4.3908 3.5223 8.0848 7.6143 6.0214 4.8661 3.3842 7.3284 1.4464 1.4089 4.9939 1.4070 1.6417 1.3442 7.1657 1.3221 2.3260 3.8048 1.6572 1.9924 2.1268 1.6913 1.8153 2.0864 2.3681 2.5690 1.5721 1.4393 5.3605 4.5226 1.2444 7.1614 5.1324 2.8037 2.1304 1.6046 1.0539 2.5115 8.5091 8.0802 7.8488 8.1282 8.1064 1.0380 1.0989 1.0984 1.0930 1.0923 1.0921 1.0917 1.0931 1.0948
irintensity: 0.9354 2.1460 0.0541 0.0039 4.0799 1.2909 0.0008 0.4237 0.0093 1.2403 1.9129 8.7765 0.0414 0.1459 8.8536 4.3743 4.8375 6.0510 0.1890 12.2820 20.0953 10.3075 16.0891 1.0246 6.9336 16.7939 29.8779 14.7502 0.0192 0.0289 49.5848 33.8623 54.8031 12.1889 26.1553 4.2426 0.1022 24.6081 3.4403 38.4413 57.7906 5.6389 16.7438 18.6635 5.9088 2.7117 33.1056 56.7537 14.5972 28.6989 18.7757 415.0916 34.8871 49.3415 26.4977 2.0442 160.5722 161.1511 56.2391 21.8049 18.1570 8.9176 29.2168 38.3900 140.6723 46.6354 2.6027 7.8584 9.4150 0.7178 1.5551 0.6888 1.2742 6.0523 5.1206
temp: 298.150 k
press: 1.00000 atm
elementType: 35 35 8 7 6 6 6 6 6 6 6 6 6 6 6 6 6 6 1 1 1 1 1 1 1 1 1
symmnumber: 1
zpe: 500109.6 jmol-1
zpe.correction: 0.190482 hartree
zpe.thermalcorrener: 0.205882 hartree
zpe.thermalcorrenthalpy: 0.206826 hartree
zpe.thermalcorrgfe: 0.145556 hartree
zpe.sumelectzpe: -694.579943 hartree
zpe.sumelectthermal: -694.564543 hartree
zpe.sumelectthermalent: -694.563598 hartree
zpe.sumelectthermalfe: -694.624868 hartree
dipole: -2.7132 1.8059 0.0092
dipole: 3.2593
quadrupole: -124.4958 -119.7774 -126.9097
quadrupole: -12.3602 -0.0053 0.0451
quadrupole: -0.7682 3.9502 -3.1821 -12.3602 -0.0053 0.0451
hfenergy: -694.7704245 hartree
pointgroup: C01 [X(C14H9Br2N1O1)]
dipole: 1.0570438 -0.7237677 -0.0557358 debye
polarizability: 306.4866552|1.613928|246.6107424|-2.2476271|11.7309998|72.349556 unknown
InChI: InChI=1S/C14H9Br2NO/c1-8(18)17-13-4-2-9(15)6-11(13)12-7-10(16)3-5-14(12)17/h2-7H,1H3
charge 0 multiplicity 1
27 atoms
Br -4.353773 2.968587 0.188461
Br 4.362732 2.921345 0.096136
O  -1.270769 -3.396421 -0.274024
N  -0.030928 -1.430779 -0.154641
C  -0.73618 0.786587 -0.000755
C  0.720793 0.770875 -0.016346
C  -1.182276 -0.56725 -0.085998
C  1.142992 -0.596601 -0.110562
C  -1.661138 1.850097 0.080492
C  1.658292 1.823622 0.044747
C  -2.55792 -0.881298 -0.091783
C  2.520296 -0.90581 -0.143108
C  -0.135671 -2.847915 -0.246792
C  -3.028842 1.523623 0.074378
C  3.02352 1.490945 0.010861
C  -3.481939 0.185108 -0.010064
C  3.458823 0.14906 -0.081757
C  1.136497 -3.674321 -0.310189
H  -1.328535 2.889479 0.146639
H  1.332525 2.86482 0.116855
H  -2.899234 -1.913428 -0.156885
H  2.902536 -1.922635 -0.213178
H  -4.55407 -0.029754 -0.012338
H  4.527692 -0.079967 -0.106327
H  0.833576 -4.729171 -0.376004
H  1.757052 -3.538976 0.593254
H  1.74435 -3.423921 -1.197475
