program: Gaussian 09
title: 000258840
version: EM64L-G09RevD.01
frameworkgroup: C1[X(C19H16N4O5S2)]
method: RPBEPBE
basis: SDD
operation: Freq
keyword: #p
keyword: freq=noraman
keyword: PBEPBE/SDD
title: #p freq=noraman PBEPBE/SDD
converged: YES YES NO NO
title: Mulliken charges:
elementType: S S O O O O O N N N N C C C C C C C C C C C C C C C C C C C H H H H H H H H H H H H H H H H
charge: 0.919103 0.259487 -0.225784 -0.220986 -0.243319 -0.498931 -0.512670 -0.121575 -0.143566 -0.351095 -0.038261 0.149649 -0.619694 0.055530 -0.178440 0.204590 0.501601 0.218336 -0.370256 -0.390502 -0.063257 -0.227441 -0.230241 -0.231808 -0.800097 -0.251832 -0.217198 -0.203808 -0.225469 -0.210538 0.243758 0.278570 0.358092 0.283951 0.229223 0.236509 0.226677 0.230758 0.295203 0.283141 0.245495 0.295058 0.336134 0.243604 0.244465 0.237834
chargesum: 0.00000
title: Mulliken charges with hydrogens summed into heavy atoms:
elementType: S S O O O O O N N N N C C C C C C C C C C C C C C C C C C C
charge: 0.919103 0.259487 -0.225784 -0.220986 -0.243319 -0.498931 -0.512670 -0.121575 -0.143566 0.006996 -0.038261 0.149649 -0.097366 0.055530 -0.178440 0.204590 0.501601 0.218336 -0.086305 -0.161279 -0.063257 0.009067 -0.003564 -0.001050 0.023741 0.043226 0.118936 0.039797 0.018996 0.027296
polarizability: 5.09096481e+02 -4.77143715e+01 3.14276436e+02 -3.72875783e+00 1.00301333e+01 1.72454813e+02
1716.lowfreq: -5.2117 -0.9971 0.0009 0.0012 0.0015 2.6571 12.7709 20.8892 21.7339
frequency: 12.7321 20.8432 21.7228 30.0988 37.3101 48.5132 57.0567 58.1981 70.7057 82.3902 99.8411 116.2292 119.7758 129.6135 133.6446 144.7304 165.8107 181.9164 191.3105 225.8334 228.1513 240.7819 263.6636 279.4253 309.4293 334.2956 348.4515 353.1236 369.7712 370.9930 396.0217 403.8589 405.3699 419.2032 424.1654 449.3818 482.0189 490.1983 495.4154 519.9076 576.0039 600.0216 608.1377 615.4759 616.8673 645.6090 650.5553 652.7495 670.7900 684.3967 688.3989 697.3228 699.8610 712.0181 733.9852 759.7205 772.9277 799.5708 810.2274 817.1629 853.2668 861.1839 920.0139 924.5167 937.9186 944.5677 968.3721 983.3918 985.4828 986.1976 990.8880 991.0894 994.2145 1003.9972 1004.0570 1006.5758 1007.4868 1026.7478 1042.0832 1079.4112 1083.4027 1091.7937 1145.8403 1173.1827 1174.7157 1190.0269 1191.0721 1193.8035 1210.5608 1212.7737 1252.1484 1293.3257 1318.2790 1320.8765 1327.1128 1341.4621 1352.8487 1382.0751 1382.9346 1392.7609 1409.1825 1435.6460 1436.8661 1444.9369 1452.4582 1455.9906 1467.0787 1485.9792 1508.9097 1569.8790 1572.8198 1594.9864 1597.3758 1613.8501 1641.3089 1680.2545 3022.1062 3031.6108 3092.4051 3120.3961 3120.5570 3130.8224 3139.1966 3140.9690 3151.8068 3153.8924 3159.1938 3165.5729 3166.4505 3168.5389 3175.1408 3558.6908
redmass: 6.7826 6.0737 6.5484 5.0866 3.7975 4.6441 5.5315 6.9157 7.6443 6.3307 9.1784 4.7054 1.5476 3.8687 5.5077 9.4751 5.1183 6.0640 5.7566 5.3037 10.5178 8.7372 6.9778 11.8058 7.4822 8.0577 2.6674 10.1779 12.3020 9.5868 11.5433 2.8378 2.9841 7.4418 6.3582 8.4710 4.6602 7.2317 6.1570 6.5034 5.3877 6.5107 1.9667 5.3250 6.8053 5.5343 6.4509 7.7672 9.5265 2.7149 5.1593 4.1899 5.4199 1.6051 10.4447 1.3306 2.8249 17.4010 7.5492 3.3648 1.2357 1.2439 2.9132 12.4780 1.5586 1.3541 5.6554 1.2003 1.4674 2.4893 3.4800 1.5674 8.2086 1.7592 2.0966 1.3443 1.5062 2.2768 1.9882 6.3066 1.6816 1.6081 11.0545 1.0642 1.0598 1.5013 1.5487 1.1479 2.7825 7.7162 3.7818 2.9207 1.2992 2.4852 1.6178 1.3929 1.3445 8.1855 6.0094 2.2473 3.2763 1.0530 2.2626 2.1399 1.0576 1.9058 1.2232 2.0762 4.5102 5.5748 11.3667 6.0381 6.7646 5.9699 8.9604 9.8609 1.0615 1.0276 1.1031 1.0937 1.0866 1.0877 1.0869 1.0919 1.0965 1.0911 1.1050 1.0957 1.1015 1.1064 1.1007 1.0779
irintensity: 1.6609 1.2785 0.1013 0.8108 2.0606 0.3098 1.5913 0.5776 0.5583 0.7019 1.0890 0.9234 1.3767 6.0950 1.6119 5.1832 3.8800 2.9767 1.3269 7.3463 8.5248 22.3971 0.9254 14.0473 6.1463 8.5905 5.1658 32.9463 21.7811 4.7462 9.6699 0.0146 0.6648 44.4513 1.8501 46.6556 1.9185 17.8206 39.4293 38.2223 3.7576 0.9485 58.4755 20.2951 6.5847 3.4765 2.0119 11.7509 5.8353 22.5158 21.5295 46.8388 13.4791 92.0186 8.8694 84.3444 14.3847 53.1499 6.2394 4.9694 0.1199 0.4858 71.8589 44.4581 3.7750 4.5815 7.4597 8.1292 6.5756 9.7868 10.2781 0.7796 65.9046 1.4453 1.6529 0.7323 1.0067 6.1097 24.5949 41.8205 9.5399 4.3995 184.2649 3.1786 0.6815 70.1534 3.3381 1.8466 12.7134 195.9724 12.6844 4.1700 20.2901 299.3569 146.5401 57.5766 84.0848 7.4517 3.3848 65.5912 10.5572 14.7926 23.7589 3.0916 58.0016 30.3425 42.7690 26.6630 185.6942 4.0688 5.6407 3.5559 7.4430 3.7329 607.3396 375.9568 19.5823 21.5492 0.3897 61.1771 7.0142 6.0236 2.0475 11.0691 18.1081 6.3755 5.9462 5.6704 24.5227 6.2587 44.2266 94.0104
temp: 298.150 k
press: 1.00000 atm
elementType: 16 16 8 8 8 8 8 7 7 7 7 6 6 6 6 6 6 6 6 6 6 6 6 6 6 6 6 6 6 6 1 1 1 1 1 1 1 1 1 1 1 1 1 1 1 1
symmnumber: 1
zpe: 853840.8 jmol-1
zpe.correction: 0.325211 hartree
zpe.thermalcorrener: 0.353351 hartree
zpe.thermalcorrenthalpy: 0.354296 hartree
zpe.thermalcorrgfe: 0.262324 hartree
zpe.sumelectzpe: -2122.563416 hartree
zpe.sumelectthermal: -2122.535275 hartree
zpe.sumelectthermalent: -2122.534331 hartree
zpe.sumelectthermalfe: -2122.626302 hartree
dipole: 2.0673 -3.6353 -2.0666
dipole: 4.6648
quadrupole: -127.0051 -177.1398 -195.5060
quadrupole: -8.1656 3.1597 -1.5201
quadrupole: 39.5452 -10.5895 -28.9557 -8.1656 3.1597 -1.5201
hfenergy: -2122.8886266 hartree
pointgroup: C01 [X(C19H16N4O5S2)]
dipole: 0.7865682 -1.4984599 -0.7099911 debye
polarizability: 508.619885|-48.0396393|314.9755831|-11.9569487|-1.1393283|172.2322617 unknown
InChI: InChI=1S/C13H11N4O3S.C6H5O2S/c1-21-13-15-10-9(11(18)17(20)12(19)14-10)16(13)7-8-5-3-2-4-6-8;7-9(8)6-4-2-1-3-5-6/h2-6,14H,7H2,1H3;1-5H
charge 0 multiplicity 1
46 atoms
S  -2.768715 1.096098 0.139433
S  5.209324 -1.527199 -0.164344
O  -2.023798 -0.182249 1.74494
O  0.359533 1.102989 2.054917
O  -2.205257 -2.526903 0.339498
O  -2.767511 2.703801 0.392656
O  -1.839597 0.46153 -1.048528
N  2.843039 -0.412906 0.82574
N  -0.899774 -0.758909 1.257454
N  0.105017 -2.553384 0.028756
N  2.548809 -2.414062 -0.259383
C  1.463673 -0.711401 0.865687
C  3.494235 0.82133 1.354325
C  1.336346 -1.938318 0.191911
C  3.441686 -1.457844 0.138649
C  0.365615 0.001483 1.447758
C  3.628333 1.929053 0.313078
C  -1.081755 -1.994493 0.506753
C  2.508581 2.736537 -0.015027
C  4.86946 2.166588 -0.328059
C  -4.569917 0.533879 0.00969
C  2.630148 3.756238 -0.983959
C  4.990768 3.190097 -1.295207
C  3.86945 3.984315 -1.627615
C  5.308841 -3.277167 -0.859758
C  -5.547511 1.542421 0.066128
C  -4.838055 -0.836985 -0.126798
C  -6.896909 1.137856 -0.052089
C  -6.197805 -1.21192 -0.241696
C  -7.218097 -0.231701 -0.207249
H  4.484567 0.520069 1.741282
H  2.870244 1.157532 2.198433
H  0.025387 -3.425583 -0.498153
H  1.552862 2.573743 0.496025
H  5.741864 1.552868 -0.071688
H  1.760059 4.373833 -1.231751
H  5.954694 3.367811 -1.784893
H  3.961224 4.778173 -2.377423
H  4.670049 -3.34668 -1.749838
H  4.98173 -3.995983 -0.096483
H  6.368896 -3.423058 -1.11657
H  -5.263289 2.591613 0.192663
H  -4.031805 -1.580181 -0.114911
H  -7.689839 1.892167 -0.020722
H  -6.452435 -2.271418 -0.34691
H  -8.266865 -0.535979 -0.293422
