program: Gaussian 09
title: 000258753
version: EM64L-G09RevD.01
frameworkgroup: C1[X(C9H16N4O2)]
method: RPBEPBE
basis: SDD
operation: Freq
keyword: #p
keyword: freq=noraman
keyword: PBEPBE/SDD
title: #p freq=noraman PBEPBE/SDD
converged: YES YES NO NO
title: Mulliken charges:
elementType: O O N N N N C C C C C C C C C H H H H H H H H H H H H H H H H
charge: -0.278079 -0.252642 -0.403928 0.045252 -0.403357 -0.652826 -0.043179 -0.475958 -0.414554 -0.530339 -0.532745 0.159166 0.251319 -0.778763 0.296361 0.273438 0.226340 0.225970 0.262157 0.211445 0.261607 0.194526 0.237148 0.200231 0.301764 0.252293 0.255041 0.209000 0.261377 0.343439 0.298495
chargesum: 0.00000
title: Mulliken charges with hydrogens summed into heavy atoms:
elementType: O O N N N N C C C C C C C C C
charge: -0.278079 -0.252642 -0.102163 0.045252 -0.141980 -0.010892 0.230259 -0.023648 0.059048 -0.074206 -0.095365 0.159166 0.251319 -0.062429 0.296361
polarizability: 1.98311276e+02 1.04254161e+00 1.22415673e+02 2.68380665e+00 4.51597534e+00 9.54645280e+01
1716.lowfreq: -10.2210 -4.1502 0.0007 0.0010 0.0012 14.3398 18.5044 31.1169 41.3605
frequency: 18.2690 30.1841 40.6588 69.9123 78.7562 91.4760 123.4285 139.4309 181.3856 198.3544 241.4904 282.7983 311.6742 352.0170 358.0575 380.8803 419.5001 438.3068 469.3646 488.2777 510.6681 529.1012 551.5560 579.3421 591.8810 601.8105 633.4403 701.0380 710.1131 769.5425 776.4170 839.6479 891.1678 913.5991 929.8440 958.4892 965.2523 978.5376 1012.9101 1040.8509 1041.1022 1042.2095 1085.0307 1093.0735 1117.9318 1132.5398 1158.9265 1209.1566 1242.0456 1258.1511 1270.1988 1292.7612 1297.6601 1313.2644 1322.4245 1340.1900 1354.8717 1363.3675 1387.3744 1448.3435 1449.9756 1454.1183 1460.2015 1466.9813 1472.3000 1478.1212 1487.1261 1602.3224 1613.3695 1622.2992 1682.7975 2938.5054 2966.5272 2991.8489 2994.7728 2995.7739 3016.2644 3025.0337 3054.3067 3072.6622 3075.1057 3096.0735 3098.4204 3411.5116 3537.8507 3548.4702 3696.7934
redmass: 4.8869 4.0287 4.8742 1.8396 1.9591 3.0849 4.2080 3.6579 4.2266 3.2745 1.4104 3.9444 2.3402 2.7611 2.6401 2.5718 2.1765 2.6641 2.0296 1.3102 1.3881 2.0157 2.7278 2.5309 3.5982 3.2503 4.1668 2.6405 8.6100 1.5687 3.4905 3.0465 2.7407 2.6005 2.6021 1.9581 2.1452 2.5944 1.7298 2.2567 1.6549 2.3229 2.2215 1.4460 2.2442 1.6236 1.5161 1.4259 1.6081 1.6559 1.7089 2.4673 1.3403 1.8597 1.5949 1.4652 1.5077 1.2933 1.2344 1.1444 1.0465 1.3247 1.1076 1.1017 1.1218 1.4381 1.7325 1.2288 6.2950 7.6830 5.4981 1.0695 1.0602 1.0633 1.0366 1.0658 1.0866 1.0928 1.1012 1.1006 1.0917 1.0997 1.0988 1.0746 1.0460 1.0778 1.1034
irintensity: 20.2912 1.1263 13.0988 4.3066 5.2494 4.8120 3.8023 0.0762 0.3514 8.9986 6.2928 2.4093 16.6099 3.1123 20.1717 7.9976 54.9648 6.9422 103.0429 147.0428 96.1742 16.1089 32.0286 55.9050 10.4303 2.0033 9.5517 13.6257 19.0584 1.5784 1.4767 1.2374 4.8409 6.0141 2.5209 9.3085 12.4049 2.2867 1.0374 17.9667 12.8729 10.9981 96.5056 34.0270 49.0276 15.6229 4.5478 61.4384 59.4119 18.4895 19.5298 253.9583 10.5403 96.4249 7.4343 6.7970 5.5821 4.1084 68.8807 42.4241 15.3666 212.6037 13.1943 34.4010 50.3901 185.9648 309.7450 133.5143 175.0374 2.1008 327.0640 48.0268 24.8974 26.7077 14.3224 6.5622 47.5060 43.1053 33.9361 17.9304 18.2294 18.4599 12.3491 18.9954 43.2835 14.5204 43.3107
temp: 298.150 k
press: 1.00000 atm
elementType: 8 8 7 7 7 7 6 6 6 6 6 6 6 6 6 1 1 1 1 1 1 1 1 1 1 1 1 1 1 1 1
symmnumber: 1
zpe: 671581.1 jmol-1
zpe.correction: 0.255792 hartree
zpe.thermalcorrener: 0.271945 hartree
zpe.thermalcorrenthalpy: 0.272889 hartree
zpe.thermalcorrgfe: 0.209991 hartree
zpe.sumelectzpe: -720.850303 hartree
zpe.sumelectthermal: -720.834149 hartree
zpe.sumelectthermalent: -720.833205 hartree
zpe.sumelectthermalfe: -720.896103 hartree
dipole: 1.2714 -2.8810 1.8967
dipole: 3.6761
quadrupole: -107.1258 -85.7167 -89.1162
quadrupole: 34.0254 14.2724 -3.1864
quadrupole: -13.1396 8.2696 4.8700 34.0254 14.2724 -3.1864
hfenergy: -721.1060943 hartree
pointgroup: C01 [X(C9H16N4O2)]
dipole: -0.5300626 1.0614739 0.8271032 debye
polarizability: 198.2661462|2.8274199|123.0364876|-1.574606|-2.4000821|94.8888428 unknown
InChI: InChI=1S/C9H16N4O2/c1-6(14)11-7-2-4-8(5-3-7)12-13-9(10)15/h7,11,13H,2-5,10H2,1H3
charge 0 multiplicity 1
31 atoms
O  -4.23451 1.198361 -0.682527
O  4.9323 -0.742983 0.261067
N  -2.829802 -0.38993 0.262276
N  2.122127 -0.560574 0.293053
N  2.94752 0.553464 0.280419
N  5.046863 1.585819 0.298724
C  -1.910307 -0.428572 -0.899907
C  -1.048379 -1.710963 -0.849985
C  -1.01318 0.836301 -0.961634
C  -0.007955 -1.68103 0.304838
C  0.011858 0.888439 0.206226
C  0.815077 -0.405097 0.276049
C  -3.955482 0.41774 0.280259
C  -4.83878 0.303677 1.520757
C  4.352453 0.371125 0.279674
H  -2.54518 -0.432608 -1.806409
H  -0.507848 -1.797941 -1.810948
H  -1.696438 -2.603891 -0.759648
H  -1.657929 1.732246 -0.950009
H  -0.472011 0.827033 -1.92783
H  0.675619 -2.54395 0.239514
H  -0.529244 -1.759153 1.284491
H  -0.543767 1.017425 1.157976
H  0.64142 1.791563 0.088412
H  -2.653345 -1.019749 1.046512
H  -4.94856 1.301182 1.979862
H  -5.846938 -0.0252 1.21427
H  -4.451037 -0.3985 2.279497
H  2.560382 1.505772 0.264536
H  6.061607 1.525515 0.290573
H  4.607365 2.502679 0.346817
