program: Gaussian 09
title: 000258743
version: EM64L-G09RevD.01
frameworkgroup: C1[X(C15H17N3)]
method: RPBEPBE
basis: SDD
operation: Freq
keyword: #pfreq=noraman
keyword: PBEPBE/SDD
title: #p freq=noraman PBEPBE/SDD
converged: YES YES NO NO
title: Mulliken charges:
elementType: N N N C C C C C C C C C C C C C C C H H H H H H H H H H H H H H H H H
charge: -0.249461 -0.257852 -0.693913 0.187978 0.281467 0.199009 0.229719 -0.556432 0.256852 -0.616711 0.434650 -0.404072 -0.652460 -0.377738 -0.255890 -0.235034 -0.621389 -0.621706 0.257420 0.220413 0.231816 0.236350 0.232941 0.235551 0.224556 0.218207 0.217726 0.216166 0.176808 0.242132 0.216200 0.242106 0.176755 0.298878 0.308960
chargesum: 0.00000
title: Mulliken charges with hydrogens summed into heavy atoms:
elementType: N N N C C C C C C C C C C C C C C C
charge: -0.249461 -0.257852 -0.086075 0.187978 0.281467 0.199009 0.229719 -0.299012 0.256852 -0.396298 0.434650 -0.172256 0.052382 -0.153182 -0.037684 -0.017308 0.013717 0.013354
polarizability: 3.11702299e+02 2.27547603e+01 1.95688108e+02 -3.74456914e-01 8.32502961e-01 9.46424792e+01
1716.lowfreq: -0.0009 -0.0008 -0.0007 2.4536 4.5004 8.8967 47.3558 52.4572 62.3678
frequency: 47.1554 52.3868 62.3502 89.8338 100.8190 122.4875 144.4760 163.7865 176.0424 189.8327 218.2148 248.6541 270.5461 287.9211 289.6581 309.3219 346.3473 364.7641 383.6994 418.1366 435.1465 451.3732 493.7883 531.4158 539.7112 573.0815 589.6350 620.8070 654.7772 701.6843 718.5251 740.5138 748.2914 749.7638 764.7023 822.2848 826.9933 847.3183 917.5737 924.7921 925.7784 964.9424 969.1970 1018.0388 1031.0738 1046.8036 1048.3578 1096.8082 1110.5950 1116.3226 1117.4188 1128.3520 1129.5434 1167.4909 1216.9289 1225.5299 1237.1456 1261.9112 1272.4820 1301.2956 1328.2998 1374.8919 1396.8813 1405.2871 1421.9731 1429.2039 1436.9149 1459.4642 1464.6043 1467.2346 1474.0219 1476.1774 1476.7668 1478.3254 1489.7791 1499.8002 1510.2042 1569.6528 1589.9862 1615.6608 1626.4483 1648.1868 2829.8167 2841.9818 2965.8259 2988.3704 2990.2203 3050.1313 3078.3263 3081.9560 3095.7714 3122.1448 3124.7888 3131.0604 3144.0637 3147.8284 3161.3245 3574.1533 3718.1144
redmass: 2.4341 1.1567 3.1514 4.1305 1.9503 3.0801 1.5079 3.5573 1.1158 3.0635 4.0327 2.6629 3.4614 4.4739 3.2478 1.2175 4.5945 5.5200 1.1313 3.0875 2.8707 2.9758 3.9842 4.4852 5.2797 3.9573 5.6245 4.0675 5.2462 5.3630 6.2680 2.0939 2.1622 3.1375 2.9852 4.5212 1.9740 1.4802 1.4443 2.6538 1.4276 1.3087 4.1671 2.0388 1.5024 3.9655 1.4588 1.2166 1.9768 1.3157 1.7574 1.4241 1.4880 1.1070 2.1535 5.3775 1.3805 2.7642 3.0518 2.2164 2.5194 4.1067 4.2369 4.7332 1.1141 1.4862 1.2410 2.4638 1.0573 1.6459 1.2572 1.1991 1.9788 1.0516 1.3805 2.3913 1.7419 7.9532 6.8302 3.9404 1.3991 6.9962 1.0587 1.0606 1.0395 1.0721 1.0743 1.0959 1.0965 1.0971 1.0990 1.0844 1.0909 1.0889 1.0948 1.0922 1.1002 1.0445 1.1039
irintensity: 0.5091 0.1857 0.9435 2.1646 2.6828 3.7936 1.0596 0.0491 3.7816 2.2585 0.2527 0.0925 6.4764 2.5378 2.9434 253.3031 1.1112 0.2254 0.4121 0.0752 4.8939 2.0616 5.9661 8.7146 6.6123 0.2383 4.2290 16.3034 0.3425 13.1122 0.6422 25.6469 42.8348 18.9901 5.0961 1.3268 49.3493 0.0477 11.9643 41.6006 2.4207 0.1139 8.8042 15.3669 3.1928 9.3765 12.1421 6.1340 69.2578 9.3478 24.6591 5.8332 19.1921 1.2044 7.4382 29.4187 4.5001 103.4607 60.5719 12.4061 20.5544 17.4232 53.2065 56.9299 5.4207 2.4823 12.0650 20.1379 5.2748 46.4220 34.6603 14.8624 89.2786 19.8552 49.7139 59.9741 14.4692 10.3988 4.4035 8.3324 155.6348 261.3322 94.1288 254.9487 86.5095 122.5626 15.1339 28.7585 16.1881 42.4552 10.6990 0.7410 22.3510 6.0856 34.0959 10.2682 38.8798 85.4058 26.5401
temp: 298.150 k
press: 1.00000 atm
elementType: 7 7 7 6 6 6 6 6 6 6 6 6 6 6 6 6 6 6 1 1 1 1 1 1 1 1 1 1 1 1 1 1 1 1 1
symmnumber: 1
zpe: 753708.8 jmol-1
zpe.correction: 0.287073 hartree
zpe.thermalcorrener: 0.304413 hartree
zpe.thermalcorrenthalpy: 0.305357 hartree
zpe.thermalcorrgfe: 0.242343 hartree
zpe.sumelectzpe: -744.766238 hartree
zpe.sumelectthermal: -744.748898 hartree
zpe.sumelectthermalent: -744.747953 hartree
zpe.sumelectthermalfe: -744.810967 hartree
dipole: 2.1920 3.2816 0.0409
dipole: 3.9466
quadrupole: -90.1039 -90.1898 -112.7028
quadrupole: -1.2885 0.0438 -0.0103
quadrupole: 7.5616 7.4757 -15.0374 -1.2885 0.0438 -0.0103
hfenergy: -745.0533106 hartree
pointgroup: C01 [X(C15H17N3)]
dipole: 0.9022006 1.263522 0.0202079 debye
polarizability: 313.0082359|19.0944063|194.3778663|-0.049118|1.1092037|94.6467844 unknown
InChI: InChI=1S/C15H17N3/c1-17(2)15-8-11-10-6-4-5-7-13(10)18(3)14(11)9-12(15)16/h4-9H,16H2,1-3H3
charge 0 multiplicity 1
35 atoms
N  -1.523146 1.52314 -0.01593
N  3.444276 -1.184812 -0.003617
N  3.450298 1.694057 0.018253
C  -0.239455 -0.402063 -0.007908
C  -0.202855 1.034741 -0.003359
C  -1.643006 -0.79156 -0.009835
C  -2.4131 0.426154 -0.0063
C  0.982429 -1.110827 -0.00884
C  2.213772 -0.425951 -0.003326
C  1.007048 1.755392 0.008546
C  2.225011 1.022171 0.006786
C  -2.315714 -2.035019 -0.013181
C  -1.89766 2.932862 0.002969
C  -3.823028 0.414486 0.002542
C  -3.728491 -2.054173 -0.010303
C  -4.471902 -0.842366 -0.001603
C  4.216473 -1.281189 -1.248987
C  4.201472 -1.306596 1.248734
H  1.010786 -2.205631 -0.013937
H  1.025332 2.851279 0.027824
H  -1.749631 -2.973445 -0.017155
H  -1.863763 3.359186 1.025154
H  -1.216605 3.514719 -0.643403
H  -2.91994 3.052295 -0.391623
H  -4.409516 1.339561 0.019258
H  -4.260338 -3.012038 -0.011976
H  -5.567176 -0.880749 0.00544
H  4.820654 -2.210181 -1.243863
H  4.92453 -0.431836 -1.432871
H  3.525572 -1.326908 -2.107615
H  4.805956 -2.235271 1.232322
H  3.500489 -1.36925 2.098067
H  4.907253 -0.46108 1.457855
H  3.489167 2.708419 0.024875
H  4.319209 1.170883 0.0231
