program: Gaussian 09
title: 000258735
version: EM64L-G09RevD.01
frameworkgroup: C1[X(C14H11Br2N)]
method: RPBEPBE
basis: SDD
operation: Freq
keyword: #p
keyword: freq=noraman
keyword: PBEPBE/SDD
title: #p freq=noraman PBEPBE/SDD
converged: NO YES NO YES
title: Mulliken charges:
elementType: Br Br N C C C C C C C C C C C C C C H H H H H H H H H H H
charge: -0.010968 -0.007748 -0.242930 0.055702 0.222838 0.188252 0.246169 0.413292 -0.371358 -0.629633 -0.324366 -0.359577 -0.371512 -0.232365 -0.809267 -0.243552 -0.178465 0.258492 0.238922 0.238921 0.237384 0.257142 0.231477 0.246445 0.228011 0.244244 0.228016 0.246435
chargesum: 0.00000
title: Mulliken charges with hydrogens summed into heavy atoms:
elementType: Br Br N C C C C C C C C C C C C C C
charge: -0.010968 -0.007748 -0.242930 0.055702 0.222838 0.188252 0.246169 0.413292 -0.112866 0.085594 -0.067224 -0.128101 -0.125067 -0.232365 -0.108996 -0.243552 0.067970
polarizability: 3.16199638e+02 -1.15205250e+00 2.23120917e+02 -9.10877265e-03 -2.12544447e-03 7.52998188e+01
1716.lowfreq: -111.7129 -5.9259 -0.0006 -0.0002 0.0004 0.7167 2.9762 46.9784 64.5833
frequency: -111.7014 46.9771 64.5831 72.6560 81.5388 163.7218 175.2207 179.2839 203.6106 213.3504 228.9885 238.6905 269.7195 327.2445 328.9329 351.7612 378.3443 431.6979 471.7210 511.2530 526.6154 571.3523 577.7994 594.9581 620.3245 635.8811 675.3203 732.4862 764.3663 797.6056 799.6032 830.2562 867.9851 881.1112 890.3511 909.7287 937.0081 995.6929 1038.2205 1038.5906 1056.1251 1093.8773 1109.4477 1113.0060 1141.1304 1152.1518 1231.5830 1253.4378 1276.8970 1303.7062 1335.7020 1374.0859 1390.4113 1401.2350 1405.9914 1432.1512 1443.7846 1457.5101 1467.2341 1476.7727 1486.7967 1486.8348 1503.6234 1573.1863 1584.8622 1592.5147 1624.4235 2983.0671 2998.5837 3062.7900 3082.0838 3088.9018 3117.8355 3145.0141 3152.8715 3162.3182 3166.4883 3173.0882
redmass: 1.0435 3.8292 4.7239 27.7805 4.3053 3.2711 7.0172 3.7657 1.3909 5.9192 14.8503 2.6143 3.9303 5.6786 3.8709 4.1603 7.5042 3.0078 5.7355 3.5062 4.4645 3.7867 5.2764 4.2913 5.2136 7.1058 5.6814 4.3298 3.5523 1.5855 7.7667 4.0583 1.3697 1.3934 1.5948 5.4875 1.3452 1.6203 4.7672 1.5102 2.3257 1.9344 2.1615 1.3041 2.4418 1.4165 1.6966 1.5632 2.7008 2.5208 2.9298 3.1311 3.7904 1.4795 4.1739 2.3081 3.0682 1.7469 1.0452 1.3298 2.2321 1.0887 1.2463 7.9429 8.3452 7.5217 7.8830 1.0373 1.0357 1.0990 1.1017 1.0979 1.0974 1.0886 1.0919 1.0930 1.0932 1.0959
irintensity: 0.0138 0.0153 1.8828 0.0195 0.0046 1.1961 0.3290 2.2413 0.0400 2.2466 1.6344 1.8816 1.4539 1.3117 0.3703 1.1457 2.5791 4.8502 4.8540 1.1253 3.6038 16.8286 4.4995 0.0392 9.7364 34.5750 16.0997 1.1194 5.5436 46.1916 62.4131 11.4055 20.8664 25.9216 3.4373 35.1541 0.0463 11.1697 4.3897 5.1999 12.7943 42.2211 31.6345 0.6709 10.2791 5.1906 24.6498 2.1823 5.6321 101.0119 19.5416 30.0217 14.8203 4.5359 18.8910 32.2490 55.7636 43.9161 0.0811 143.1478 38.7551 34.0728 17.3282 1.1594 29.0538 6.7439 0.6542 7.0156 95.4056 4.6978 36.5357 21.9066 9.0810 8.5898 4.4829 1.2105 1.1318 6.6379
temp: 298.150 k
press: 1.00000 atm
elementType: 35 35 7 6 6 6 6 6 6 6 6 6 6 6 6 6 6 1 1 1 1 1 1 1 1 1 1 1
symmnumber: 1
zpe: 546251.2 jmol-1
zpe.correction: 0.208056 hartree
zpe.thermalcorrener: 0.222903 hartree
zpe.thermalcorrenthalpy: 0.223847 hartree
zpe.thermalcorrgfe: 0.164135 hartree
zpe.sumelectzpe: -620.602441 hartree
zpe.sumelectthermal: -620.587595 hartree
zpe.sumelectthermalent: -620.586650 hartree
zpe.sumelectthermalfe: -620.646362 hartree
dipole: -0.7138 5.7803 0.0004
dipole: 5.8242
quadrupole: -125.6227 -96.8795 -123.6405
quadrupole: -2.8743 0.0007 0.0014
quadrupole: -10.2418 18.5014 -8.2596 -2.8743 0.0007 0.0014
hfenergy: -620.8104974 hartree
pointgroup: C01 [X(C14H11Br2N1)]
dipole: 0.3721806 2.2609834 -0.0001435 debye
polarizability: 316.1414288|-2.596511|223.1791259|-0.0090158|0.0024905|75.2998188 unknown
InChI: InChI=1S/C14H11Br2N/c1-8-5-10(16)7-12-11-6-9(15)3-4-13(11)17(2)14(8)12/h3-7H,1-2H3
charge 0 multiplicity 1
28 atoms
Br 3.893376 -3.095699 -0.000264
Br -4.843217 -2.111232 0.000109
N  0.000443 1.677685 0.000014
C  1.061338 0.73712 -0.000033
C  0.488869 -0.58499 -0.000035
C  -0.955347 -0.431895 0.000014
C  -1.222756 0.978637 0.000011
C  2.473676 0.929141 -0.000068
C  1.307968 -1.737655 -0.00009
C  0.108365 3.14019 -0.000374
C  -2.021413 -1.361093 0.000048
C  -2.547645 1.470376 0.000021
C  3.269571 -0.241265 -0.000152
C  2.694022 -1.537029 -0.000163
C  3.167442 2.283173 0.000005
C  -3.331108 -0.853819 0.000067
C  -3.606845 0.538865 0.000052
H  0.876248 -2.74225 -0.000087
H  0.634274 3.506741 0.897888
H  0.63345 3.506339 -0.899296
H  -0.902533 3.574578 0.000014
H  -1.835024 -2.438827 0.000054
H  -2.776947 2.540402 0.000006
H  4.359416 -0.13854 -0.000186
H  2.913184 2.883289 0.892569
H  4.261803 2.147277 0.000006
H  2.913185 2.88339 -0.892494
H  -4.642896 0.889488 0.000063
