program: Gaussian 09
title: 000258723
version: EM64L-G09RevD.01
frameworkgroup: C1[X(C9H6O5)]
method: RPBEPBE
basis: SDD
operation: Freq
keyword: #p
keyword: freq=noraman
keyword: PBEPBE/SDD
title: #p freq=noraman PBEPBE/SDD
converged: YES YES NO NO
title: Mulliken charges:
elementType: O O O O O C C C C C C C C C H H H H H H
charge: -0.409988 -0.425824 -0.226542 -0.220742 -0.190821 0.229016 0.196091 -0.519631 0.418530 -0.310783 -0.357580 0.097878 0.116893 -0.197279 0.275231 0.280707 0.282906 0.180897 0.390500 0.390541
chargesum: 0.00000
title: Mulliken charges with hydrogens summed into heavy atoms:
elementType: O O O O O C C C C C C C C C
charge: -0.019488 -0.035283 -0.226542 -0.220742 -0.190821 0.229016 0.196091 -0.244400 0.418530 -0.030076 -0.074674 0.097878 0.116893 -0.016381
polarizability: 1.72458553e+02 9.84623426e-01 1.24538521e+02 -4.51178604e-01 -6.87264790e+00 5.31667651e+01
1716.lowfreq: -0.0002 0.0002 0.0004 6.5626 10.1475 12.0448 32.4111 76.3346 89.8353
frequency: 32.3527 76.3325 89.8344 106.1787 141.3699 171.9373 177.4842 247.7390 273.6501 311.8278 331.1778 363.3977 418.2317 477.1465 528.3242 567.2728 591.0037 598.1230 601.1584 634.9342 680.0742 713.1919 729.4985 750.6754 793.5885 872.7049 890.6116 927.2736 993.0817 1006.7002 1015.9962 1042.2533 1096.6640 1157.1734 1165.1614 1212.0921 1274.0553 1314.8064 1318.2070 1362.8670 1394.3364 1415.6061 1483.5148 1567.7273 1609.4258 1622.4771 1644.6852 1647.4940 2888.9850 3139.7320 3155.3215 3182.2819 3525.7759 3526.3050
redmass: 12.3068 8.1953 10.4970 4.1639 8.4177 5.7572 6.0864 4.9647 3.9007 7.7345 7.6483 6.4501 3.2479 4.4056 3.4427 3.3555 1.6924 2.6164 1.7656 5.1948 3.5510 4.9366 6.7030 5.7193 4.1735 1.4247 5.2088 1.4964 1.6924 4.6187 1.5613 3.3004 1.9787 1.4912 1.5140 2.5407 1.5015 2.4116 2.7944 1.8464 6.2979 2.3337 2.9594 8.9123 6.3141 7.4103 9.4750 9.3558 1.0860 1.0920 1.0901 1.0958 1.0642 1.0642
irintensity: 0.4506 1.2651 1.3203 4.0510 5.4065 10.7837 5.8409 3.9951 2.6424 6.7224 3.1714 0.3876 11.0873 3.8292 37.5592 57.3280 117.0533 106.4706 2.1388 10.2801 10.6875 51.6023 59.6776 38.1312 11.9919 39.3378 21.5286 5.4658 26.4982 183.7981 13.1656 294.0877 58.8133 21.9587 120.4743 48.3475 1.8778 42.4460 80.5060 28.5134 6.8434 38.6830 41.0255 31.6754 95.5957 149.4820 242.5965 181.5505 102.1391 0.4715 0.4825 0.5039 42.2330 56.8043
temp: 298.150 k
press: 1.00000 atm
elementType: 8 8 8 8 8 6 6 6 6 6 6 6 6 6 1 1 1 1 1 1
symmnumber: 1
zpe: 352059.9 jmol-1
zpe.correction: 0.134093 hartree
zpe.thermalcorrener: 0.146504 hartree
zpe.thermalcorrenthalpy: 0.147449 hartree
zpe.thermalcorrgfe: 0.094320 hartree
zpe.sumelectzpe: -721.689099 hartree
zpe.sumelectthermal: -721.676687 hartree
zpe.sumelectthermalent: -721.675743 hartree
zpe.sumelectthermalfe: -721.728872 hartree
dipole: 2.1548 -1.3626 1.4456
dipole: 2.9308
quadrupole: -87.6623 -72.5418 -83.1339
quadrupole: -8.0845 5.0896 5.9574
quadrupole: -6.5496 8.5709 -2.0212 -8.0845 5.0896 5.9574
hfenergy: -721.8231915 hartree
pointgroup: C01 [X(C9H6O5)]
dipole: 0.8023562 0.5449469 -0.6235511 debye
dipolederiv: -0.7881051 -0.0693441 0.4488676 -0.0274428 -0.3555313 -0.0189616 0.5050811 -0.0795108 -0.8012702 -0.4072164 -0.2526134 0.1382728 -0.3222932 -1.1232429 0.3221825 0.2007888 0.3203284 -0.5335348 -0.518165 0.1988906 0.0763318 0.1346643 -0.8956293 0.3207504 0.1473231 0.1176282 -0.5624749 -0.9533083 0.077342 -0.2484901 -0.0498186 -0.6089982 0.151105 -0.1416409 0.1932972 -0.4624141 -1.1498886 0.005105 0.0348153 0.2965369 -0.4286459 -0.0083993 0.0243207 0.0057322 -0.3220828 -0.1839617 0.0648995 0.0479678 0.2028239 -0.1930291 0.0159153 -0.0671377 0.0322115 -0.0161791 -0.363003 -0.1954436 -0.0041993 -0.2689075 0.0660856 0.0566721 0.0529567 -0.0326156 0.0036339 0.0204079 0.0958671 -0.0158608 -0.0086564 0.0139358 -0.0037684 -0.0469112 0.0079573 -0.1171989 -0.6514605 -0.1303852 0.0276514 -0.3912736 -0.1560552 0.0204134 0.0529796 0.0129312 0.0325877 -0.2407811 0.2164324 -0.0074137 0.0244936 0.0485237 -0.011077 0.062127 -0.0258524 -0.101389 0.1108171 -0.1877422 0.0018654 0.1309495 -0.032623 -0.0151064 0.0039276 0.0054183 -0.0922553 1.174462 -0.4085753 -0.5631452 -0.386354 1.1938517 -0.3769572 -0.5713926 -0.150214 0.9693295 1.5311556 0.3353912 0.2140995 0.4685169 1.3544169 -0.5249856 0.0715236 -0.4844895 0.5891908 1.6843097 0.1162596 -0.0693683 0.1984921 0.7451061 -0.0396764 -0.0939046 -0.0393864 0.1236011 0.1021497 -0.0383809 0.0003629 -0.0349627 -0.0008181 0.0025792 0.0284896 -0.0015167 0.1516317 0.101929 -0.0247223 0.001357 -0.0235837 -0.0022189 -0.0002325 -0.0334039 0.0050668 0.1537576 0.0546157 0.0689645 -0.0033632 0.0346996 0.0622044 0.0015798 0.0004168 -0.0016457 0.1554475 0.0260164 0.046159 0.0012092 -0.1090475 -0.2482216 0.0219024 0.0124554 0.015627 0.1095243 0.2953652 0.0783296 -0.0016679 0.0781077 0.1923712 0.0650981 -0.0745619 0.1140922 0.3583692 0.1546614 0.0035665 -0.0792923 0.0530554 0.3685179 0.0209662 -0.1334373 -0.0150591 0.3617258 unknown
polarizability: 172.2394304|-0.0825485|124.1369039|-5.3412091|-8.6242304|53.7875048 unknown
InChI: InChI=1S/C9H6O5/c10-4-5-1-2-6(8(11)12)7(3-5)9(13)14/h1-4,11,13H
charge 0 multiplicity 1
20 atoms
O  2.284421 -1.475856 -1.125265
O  2.159994 2.491083 -0.544324
O  1.319793 -2.814218 0.514273
O  2.942123 0.655919 0.647143
O  -4.504883 0.139669 0.170954
C  0.307243 -0.662405 -0.034926
C  0.600134 0.73215 -0.071628
C  -1.037568 -1.08434 0.059316
C  -2.093499 -0.141974 0.069633
C  -0.463912 1.67309 -0.079743
C  -1.800524 1.244058 -0.018325
C  1.342439 -1.744118 -0.133781
C  2.006979 1.230447 0.048145
C  -3.501712 -0.619164 0.163616
H  -1.251112 -2.158298 0.116137
H  -0.219157 2.737658 -0.118582
H  -2.631296 1.957505 -0.021357
H  -3.619394 -1.729766 0.229822
H  2.977997 -2.189295 -1.129984
H  3.094436 2.803752 -0.405024
