program: Gaussian 09
title: 000023451
version: EM64L-G09RevD.01
frameworkgroup: C1[X(C13H11N3O2)]
method: RPBEPBE
basis: SDD
operation: Freq
keyword: #p
keyword: freq=noraman
keyword: PBEPBE/SDD
title: #p freq=noraman PBEPBE/SDD
converged: YES YES NO NO
title: Mulliken charges:
elementType: O O N N N C C C C C C C C C C C C C H H H H H H H H H H H
charge: -0.209176 -0.208795 -0.082683 -0.114608 0.022586 0.376712 -0.005870 -0.389210 0.173820 -0.284861 -0.788653 0.383349 -0.219206 -0.318926 -0.255873 -0.217356 -0.338485 -0.335766 0.240248 0.277398 0.243360 0.243569 0.218439 0.234150 0.262559 0.282028 0.234986 0.289570 0.286697
chargesum: 0.00000
title: Mulliken charges with hydrogens summed into heavy atoms:
elementType: O O N N N C C C C C C C C C C C C C
charge: -0.209176 -0.208795 -0.082683 -0.114608 0.022586 0.376712 -0.005870 -0.148963 0.173820 -0.007463 -0.083284 0.383349 0.014943 -0.056367 0.026154 0.017629 -0.048916 -0.049069
polarizability: 4.36973152e+02 -9.69792306e-01 1.77486286e+02 -8.74905371e-02 -1.15071323e-01 6.75566005e+01
1716.lowfreq: -8.2804 -4.2012 -0.0007 -0.0004 0.0004 6.3766 16.6171 38.4762 55.4389
frequency: 16.5983 38.4731 55.4385 66.1866 90.1638 96.4940 159.7298 170.0762 186.6974 196.6446 265.0277 270.1615 335.3910 363.5490 412.4958 425.6614 450.8870 491.0443 495.6070 511.3989 543.7428 555.3612 586.5718 623.5038 662.7492 666.8556 721.2590 748.7379 752.3944 784.8506 788.8671 834.2366 851.2362 881.7284 884.6128 897.3277 972.2158 985.3636 994.7194 995.8591 1000.8484 1008.1981 1039.0605 1045.5785 1089.5396 1095.2090 1105.1216 1144.5770 1170.6982 1177.0000 1201.5413 1212.2145 1233.3773 1279.7662 1285.0045 1344.4913 1361.0909 1382.9272 1400.4213 1405.7488 1422.0057 1428.6536 1459.7577 1461.9818 1471.9013 1476.0764 1576.0383 1584.0761 1599.2039 1602.6146 2993.3716 3077.5669 3095.1087 3128.9770 3141.6681 3157.6754 3164.2502 3167.8744 3171.9674 3185.5911 3189.6458
redmass: 4.3945 7.3838 5.7014 7.3935 1.5650 2.1431 7.3855 6.4723 3.5138 6.8208 4.9096 4.9204 5.8433 4.6226 2.9893 5.7659 2.8983 6.5411 3.2549 6.0997 3.5431 6.0153 7.6287 7.2158 7.3328 4.5447 2.4023 3.4551 6.5864 1.6012 6.8171 5.5281 1.2424 1.4302 1.4950 7.1215 1.3825 1.5910 2.8177 1.3482 1.3428 1.3445 2.0069 1.5738 3.4296 1.8532 1.4765 1.5301 1.1184 1.8210 2.7106 7.0351 3.7579 1.4771 1.3887 7.3190 9.1934 6.4152 1.2914 8.2284 3.4156 2.2897 1.0466 2.4032 2.5920 1.1768 6.6015 7.8013 6.3206 6.2810 1.0363 1.0968 1.1006 1.0862 1.0903 1.0948 1.0897 1.0882 1.0988 1.0963 1.0966
irintensity: 0.0023 0.3050 0.2965 0.0033 2.1334 0.4914 5.0711 1.2175 2.0406 0.3761 5.5080 0.2924 0.1009 0.3050 0.0106 20.6669 3.7641 3.8273 9.3714 2.1376 5.0907 4.2475 6.7216 0.3796 6.3186 27.6235 25.2198 4.1900 11.9135 46.2059 26.5696 3.0484 0.8735 28.1026 47.0808 0.2283 1.9947 2.5091 1.9633 0.3117 0.1024 0.0801 4.1492 9.8705 47.1864 9.5667 22.0350 50.8309 48.2464 8.8641 163.3540 592.2200 3.1185 6.1917 9.9590 95.1917 124.4284 7.1583 18.2132 5.8888 38.2802 11.6266 13.7094 4.2310 16.3573 29.0778 14.4384 10.0893 85.7631 3.7939 19.4509 12.4788 28.1931 3.6448 16.4849 23.8075 1.8162 1.9356 32.1797 0.1294 0.5220
temp: 298.150 k
press: 1.00000 atm
elementType: 8 8 7 7 7 6 6 6 6 6 6 6 6 6 6 6 6 6 1 1 1 1 1 1 1 1 1 1 1
symmnumber: 1
zpe: 564448.0 jmol-1
zpe.correction: 0.214987 hartree
zpe.thermalcorrener: 0.230554 hartree
zpe.thermalcorrenthalpy: 0.231498 hartree
zpe.thermalcorrgfe: 0.169680 hartree
zpe.sumelectzpe: -815.305237 hartree
zpe.sumelectthermal: -815.289670 hartree
zpe.sumelectthermalent: -815.288726 hartree
zpe.sumelectthermalfe: -815.350543 hartree
dipole: 7.0512 -0.2988 -0.0010
dipole: 7.0576
quadrupole: -122.4920 -93.8556 -106.9749
quadrupole: 4.4080 -0.0376 0.0043
quadrupole: -14.7178 13.9186 0.7992 4.4080 -0.0376 0.0043
hfenergy: -815.5202235 hartree
pointgroup: C01 [X(C13H11N3O2)]
dipole: -2.7754862 0.0376108 0.0715364 debye
polarizability: 436.6002787|6.6275792|177.348649|-8.8858731|5.5447768|68.0671106 unknown
InChI: InChI=1S/C13H11N3O2/c1-10-4-2-3-5-13(10)15-14-11-6-8-12(9-7-11)16(17)18/h2-9H,1H3
charge 0 multiplicity 1
29 atoms
O  5.858452 0.962971 -0.091463
O  5.564291 -1.297336 -0.210119
N  -1.313913 -0.298183 0.02219
N  -0.534428 0.75547 0.057348
N  5.10975 -0.089787 -0.131212
C  -3.574455 -1.164025 0.037836
C  -2.71235 -0.018658 0.070402
C  -4.971922 -0.938831 0.083478
C  0.86414 0.448925 0.006169
C  -3.251525 1.299937 0.145822
C  -3.020227 -2.57272 -0.042859
C  3.641009 0.098477 -0.083445
C  -5.505622 0.367148 0.158103
C  1.727769 1.577131 0.048285
C  1.411905 -0.865277 -0.081757
C  -4.641115 1.491529 0.189243
C  3.122733 1.409974 0.003897
C  2.801985 -1.042535 -0.126733
H  -5.648896 -1.800252 0.060096
H  -2.554788 2.143304 0.168225
H  -2.414444 -2.712728 -0.955547
H  -2.35416 -2.790734 0.810367
H  -3.837648 -3.313544 -0.048122
H  -6.5915 0.510055 0.191731
H  1.276414 2.571578 0.115698
H  0.727784 -1.717736 -0.112923
H  -5.057686 2.502799 0.246803
H  3.809934 2.258987 0.034845
H  3.256614 -2.034439 -0.19426
