program: Gaussian 09
title: 000258717
version: EM64L-G09RevD.01
frameworkgroup: C1[X(C10H12N4O)]
method: RPBEPBE
basis: SDD
operation: Freq
keyword: #p
keyword: freq=noraman
keyword: PBEPBE/SDD
title: #p freq=noraman PBEPBE/SDD
converged: YES YES NO NO
title: Mulliken charges:
elementType: O N N N N C C C C C C C C C C H H H H H H H H H H H H
charge: -0.269814 -0.172770 0.046604 -0.373733 -0.040070 -0.071497 -0.425043 -0.505281 -0.442947 -0.441715 0.174056 -0.233671 0.090494 -0.125551 -0.224837 0.280100 0.215244 0.255094 0.238325 0.245628 0.232291 0.224664 0.223293 0.230269 0.268572 0.333934 0.268362
chargesum: 0.00000
title: Mulliken charges with hydrogens summed into heavy atoms:
elementType: O N N N N C C C C C C C C C C
charge: -0.269814 -0.172770 0.046604 -0.039799 -0.040070 0.208602 0.045296 -0.021328 0.014007 0.011847 0.174056 0.034901 0.090494 -0.125551 0.043524
polarizability: 1.86339694e+02 -2.46650378e+00 1.30562374e+02 6.35576029e+00 -1.82858279e-01 8.22020262e+01
1716.lowfreq: -7.9441 -5.2374 -0.0007 -0.0006 0.0002 12.4436 36.5349 68.3063 93.1036
frequency: 36.2516 68.2960 93.0912 144.6848 165.9759 198.1712 241.2304 262.4072 290.1843 308.8981 423.0497 469.6327 524.0429 561.9561 583.5618 607.5469 623.3771 671.9717 673.6692 692.6866 731.0145 752.6675 765.0082 773.6258 825.1211 831.5546 869.7819 885.5534 899.6794 905.9213 917.3199 941.4614 973.1135 1023.7938 1052.9840 1065.8189 1078.2866 1091.9502 1144.3270 1158.2434 1162.7081 1188.9488 1213.0999 1236.8067 1242.7636 1254.5642 1291.5771 1295.4762 1318.2372 1319.1199 1321.5259 1336.7355 1380.2087 1385.5056 1399.1913 1460.7313 1471.1357 1472.1357 1480.5104 1482.4780 1495.3049 1522.3148 1652.1804 2999.1912 3005.4420 3007.2432 3019.0794 3048.2804 3067.5244 3068.7299 3079.4384 3088.0847 3184.2149 3241.9636 3581.3593
redmass: 4.0197 4.4172 2.4804 3.5439 4.1653 3.9805 3.3784 3.7325 4.3552 5.6522 4.2763 3.4766 8.8768 3.3828 3.8838 3.7426 3.3953 7.3601 1.5320 3.1759 5.1928 3.8963 1.3297 6.5928 1.5232 2.0614 5.1079 2.6180 1.4301 2.1731 5.6130 1.6507 2.9949 1.5812 2.9465 2.1102 2.2996 1.9134 1.6678 1.8669 2.5276 1.4496 1.9197 1.5012 2.1403 1.3647 1.3381 1.2165 1.7475 2.4762 1.5132 2.6116 2.1766 2.5660 1.5934 1.1168 1.1913 2.5462 1.0940 5.1587 1.0986 7.8303 11.3362 1.0600 1.0656 1.0616 1.0651 1.1011 1.0930 1.0968 1.1005 1.1032 1.0915 1.0991 1.0825
irintensity: 0.7739 1.1888 0.1328 10.2983 6.7760 0.6606 1.3113 5.6352 6.5518 13.5238 0.3871 2.1164 0.4764 0.7938 4.0581 13.8272 13.6289 6.7819 78.5053 29.5135 0.7794 1.4124 6.6781 1.2674 16.6701 8.4074 4.3399 0.8840 9.0233 10.6645 1.7930 10.3925 4.6757 2.1674 6.9522 15.3525 25.8375 26.7209 2.5874 4.6680 42.3600 3.5155 43.1004 2.8739 1.6534 35.8550 1.6028 6.0529 12.9481 11.9838 3.0135 69.0638 29.5144 72.9924 14.0493 16.3348 5.4991 33.3414 14.5428 9.8403 23.7537 81.6021 375.3329 19.8594 22.2706 47.7798 22.8248 8.8030 2.2353 10.0653 23.0961 94.9907 2.9260 1.4259 73.7660
temp: 298.150 k
press: 1.00000 atm
elementType: 8 7 7 7 7 6 6 6 6 6 6 6 6 6 6 1 1 1 1 1 1 1 1 1 1 1 1
symmnumber: 1
zpe: 568834.6 jmol-1
zpe.correction: 0.216658 hartree
zpe.thermalcorrener: 0.228582 hartree
zpe.thermalcorrenthalpy: 0.229526 hartree
zpe.thermalcorrgfe: 0.177779 hartree
zpe.sumelectzpe: -681.411411 hartree
zpe.sumelectthermal: -681.399486 hartree
zpe.sumelectthermalent: -681.398542 hartree
zpe.sumelectthermalfe: -681.450290 hartree
dipole: -1.9906 2.4924 -0.0424
dipole: 3.1900
quadrupole: -68.1476 -103.4106 -87.5587
quadrupole: 15.2428 1.7802 1.4884
quadrupole: 18.2247 -17.0383 -1.1864 15.2428 1.7802 1.4884
hfenergy: -681.6280682 hartree
pointgroup: C01 [X(C10H12N4O1)]
dipole: 0.7554813 0.9826102 -0.1972319 debye
polarizability: 185.436952|6.4365747|128.1208867|9.4823177|-10.8751874|85.5462552 unknown
InChI: InChI=1S/C10H12N4O/c15-10-8-9(12-5-11-8)13-6-14(10)7-3-1-2-4-7/h5-7,11H,1-4H2
charge 0 multiplicity 1
27 atoms
O  -0.329857 2.324919 -0.379681
N  0.61785 0.238594 0.283993
N  -0.69648 -1.801165 0.534557
N  -3.009806 0.746146 -0.424374
N  -3.126737 -1.483557 0.066297
C  1.968616 0.898384 0.319184
C  2.694013 0.770499 -1.049751
C  2.961905 0.2499 1.320578
C  3.39405 -0.610014 -0.986649
C  3.83354 -0.767445 0.50426
C  -0.4851 1.092555 -0.105588
C  0.447177 -1.120909 0.566332
C  -1.712863 0.343045 -0.12154
C  -1.800171 -1.040431 0.179829
C  -3.818192 -0.383437 -0.296489
H  1.75421 1.952935 0.5568
H  3.445587 1.58038 -1.114801
H  2.005129 0.888014 -1.902795
H  2.450089 -0.206194 2.18608
H  3.599311 1.05585 1.725806
H  4.245878 -0.678844 -1.685383
H  2.682853 -1.409317 -1.267935
H  3.698432 -1.806399 0.856508
H  4.905744 -0.530661 0.622785
H  1.3516 -1.66336 0.848058
H  -3.289337 1.691784 -0.685729
H  -4.890741 -0.358774 -0.474448
