program: Gaussian 09
title: 000258715
version: EM64L-G09RevD.01
frameworkgroup: C1[X(C4H7N5OS)]
method: RPBEPBE
basis: SDD
operation: Freq
keyword: #p
keyword: freq=noraman
keyword: PBEPBE/SDD
title: #p freq=noraman PBEPBE/SDD
converged: YES YES NO NO
title: Mulliken charges:
elementType: S O N N N N N C C C C H H H H H H H
charge: 0.502780 -0.302249 -0.374075 -0.419072 -0.434945 -0.365429 -0.503682 0.233543 -0.031275 0.235546 -0.604676 0.370869 0.245231 0.245254 0.217922 0.366965 0.308642 0.308651
chargesum: 0.00000
title: Mulliken charges with hydrogens summed into heavy atoms:
elementType: S O N N N N N C C C C
charge: 0.502780 -0.302249 -0.003206 -0.419072 -0.434945 0.001537 0.113611 0.233543 -0.031275 0.235546 0.103730
polarizability: 1.33458615e+02 6.76826019e+00 1.22119596e+02 3.42284492e-03 -2.95448010e-03 4.89286964e+01
1716.lowfreq: -7.0159 -0.0017 0.0014 0.0024 5.8743 6.7664 66.4102 75.1575 94.0879
frequency: 66.4039 75.1506 94.0848 130.3678 130.9389 143.3023 187.3074 211.5652 289.9688 295.0635 334.2676 383.2195 469.8562 497.7534 541.5014 654.1385 661.5516 672.1952 689.2823 707.5955 742.2001 763.5578 780.9899 868.8854 1022.7731 1089.9194 1125.7092 1153.4044 1196.0705 1251.5150 1280.2518 1313.6546 1385.9732 1436.9751 1458.7336 1472.1467 1480.8615 1489.3094 1571.3187 1603.5431 1674.4377 2977.0088 3049.6311 3110.7997 3400.0149 3417.2004 3519.8078 3520.3715
redmass: 5.4579 1.5814 1.0950 4.3277 2.4760 3.8038 4.2565 3.7435 8.2662 5.4070 4.6935 11.6387 10.4998 7.8724 9.9652 7.8170 10.7495 1.1370 1.1200 12.8002 1.5586 6.4283 9.0153 6.6870 4.8591 4.7390 1.2846 1.8811 3.7960 2.6297 1.1628 3.6173 3.6298 1.2719 1.0393 1.7887 2.8220 1.0786 3.6054 6.6370 1.0628 1.0355 1.1008 1.0999 1.0426 1.0801 1.0997 1.0795
irintensity: 12.2294 21.7090 0.6420 2.7337 10.9394 0.5508 1.7337 7.5372 0.1221 29.8352 16.1903 0.2774 17.1958 14.9339 2.0311 12.2632 3.6821 15.0504 250.2616 36.7547 145.5061 23.1159 8.7642 10.5126 8.2914 15.7564 2.1011 12.1143 4.5390 47.0497 0.1284 22.3061 19.5482 15.6688 13.6268 55.3072 280.6222 20.0008 154.9391 309.0373 27.0386 59.2107 33.7514 21.2579 1.1641 161.8289 3.4064 55.2053
temp: 298.150 k
press: 1.00000 atm
elementType: 16 8 7 7 7 7 7 6 6 6 6 1 1 1 1 1 1 1
symmnumber: 1
zpe: 337302.5 jmol-1
zpe.correction: 0.128472 hartree
zpe.thermalcorrener: 0.140146 hartree
zpe.thermalcorrenthalpy: 0.141090 hartree
zpe.thermalcorrgfe: 0.090115 hartree
zpe.sumelectzpe: -902.794187 hartree
zpe.sumelectthermal: -902.782513 hartree
zpe.sumelectthermalent: -902.781569 hartree
zpe.sumelectthermalfe: -902.832544 hartree
dipole: 0.9513 1.5247 -0.0001
dipole: 1.7971
quadrupole: -70.2228 -68.5727 -70.7128
quadrupole: -1.8358 0.0045 0.0049
quadrupole: -0.3867 1.2634 -0.8767 -1.8358 0.0045 0.0049
hfenergy: -902.9226592 hartree
pointgroup: C01 [X(C4H7N5O1S1)]
dipole: 0.3219657 -0.6294716 0.0011373 debye
dipolederiv: -0.15496 0.2635591 -0.0006027 0.3287984 -0.0314338 0.0005905 -0.0003678 -0.0001479 0.2311008 -0.7252615 0.0825163 -0.0002706 -0.1087061 -0.9795155 0.0008847 0.0000765 0.0013514 -0.3685809 -0.5061145 -0.1984058 0.0002746 -0.3576898 -1.145253 0.0008744 0.0004815 0.0010789 -0.4498641 -0.0367164 -0.5872631 0.0007832 -0.5568492 0.134893 -0.0010155 0.0008353 -0.0005543 -0.2890194 -0.1094604 0.6402116 -0.0006814 -0.4034818 -0.3144793 -0.0001234 0.0007527 0.0009068 -0.3301811 -0.7328746 -0.1993021 0.0003875 -0.6032291 -0.2214138 -0.0003513 0.0011184 -0.0002003 -0.4259921 -0.3524974 -0.1433641 -0.0000047 -0.2470147 -0.273986 0.0000633 -0.0000008 0.000194 -0.0406997 -0.258512 -0.0097845 -0.000303 0.5600017 1.2538294 -0.0014053 -0.0011951 -0.0021572 0.1890531 -0.2903027 0.0010884 -0.0000913 0.5853664 -0.5359809 0.0011943 -0.000952 0.0010196 0.0572028 1.610184 -0.0521681 0.0005314 0.2138517 1.1135373 -0.001393 0.0000301 -0.0016874 0.2530518 0.4994969 0.2512989 -0.000144 0.143805 0.3108183 0.0000323 -0.0000122 0.0000328 0.2581535 0.4014614 -0.0112517 -0.0000019 -0.067963 0.2392277 0.0000976 0.0001961 0.0001453 0.3352042 -0.0352179 -0.0824261 -0.0739868 0.0544243 0.0632392 0.07573 -0.1143856 0.0109622 -0.0694179 -0.0354815 -0.0820842 0.0743056 0.0549876 0.0629715 -0.0761145 0.1142146 -0.0115926 -0.0687153 0.0758961 0.0500068 -0.0001457 -0.0417003 -0.1604244 0.0004786 0.0000054 0.0005479 0.123201 0.2233972 0.0606557 -0.0002005 0.1003218 0.1924881 0.0002713 -0.0004676 0.0001569 0.3513441 0.2136723 0.0083265 -0.085167 0.1726166 0.1455007 -0.1243518 -0.0791482 -0.0658084 0.1221859 0.2132911 0.0083863 0.0853173 0.1724605 0.1459813 0.1245379 0.0788186 0.0657524 0.1219734 unknown
polarizability: 132.2315513|-7.6299567|123.346459|0.0474883|-0.1177355|48.9288976 unknown
InChI: InChI=1S/C4H7N5OS/c1-6-3-2(4(10)7-5)8-11-9-3/h6-7H,5H2,1H3
charge 0 multiplicity 1
18 atoms
S  -1.53559 2.481387 -0.004674
O  1.35658 -1.52094 0.00294
N  -1.4255 -1.401145 0.001014
N  0.15693 1.904765 -0.003873
N  -2.270726 0.839681 -0.003089
N  2.53615 0.497731 -0.000386
N  3.826608 -0.086964 0.001475
C  -1.234407 -0.049288 -0.001024
C  0.112554 0.561424 -0.001322
C  1.372848 -0.240753 0.000172
C  -2.763617 -1.994395 0.000839
H  -0.564745 -1.966013 0.002509
H  -3.337846 -1.68201 -0.891661
H  -3.339466 -1.678813 0.891156
H  -2.669452 -3.091942 0.002906
H  2.4810 1.52034 -0.001666
H  3.975332 -0.652725 -0.845663
H  3.973947 -0.650635 0.850247
