program: Gaussian 09
title: 000258705
version: EM64L-G09RevD.01
frameworkgroup: C1[X(C9H17FN2O)]
method: RPBEPBE
basis: SDD
operation: Freq
keyword: #p
keyword: freq=noraman
keyword: PBEPBE/SDD
title: #p freq=noraman PBEPBE/SDD
converged: YES YES NO NO
title: Mulliken charges:
elementType: F O N N C C C C C C C C C H H H H H H H H H H H H H H H H H
charge: -0.258430 -0.322796 -0.434035 -0.414044 -0.026963 -0.456434 -0.419796 -0.408643 -0.399659 -0.377229 0.305010 -0.370651 -0.192954 0.252959 0.215495 0.202366 0.190421 0.246205 0.177273 0.208471 0.203110 0.198595 0.193610 0.200959 0.284030 0.297195 0.256406 0.232479 0.200480 0.216571
chargesum: 0.00000
title: Mulliken charges with hydrogens summed into heavy atoms:
elementType: F O N N C C C C C C C C C
charge: -0.258430 -0.322796 -0.150005 -0.116848 0.225996 -0.038573 0.016830 -0.022900 0.002045 0.017340 0.305010 0.118233 0.224098
polarizability: 1.40830317e+02 -3.59232661e+00 1.04342425e+02 -3.66486193e+00 -2.69910833e+00 9.34943500e+01
1716.lowfreq: -12.7478 -5.8185 -0.0010 -0.0008 -0.0004 20.6222 26.9870 49.9423 58.0274
frequency: 23.7030 44.7977 57.7844 72.3960 105.2011 110.8635 180.3597 201.1613 252.2372 265.6725 308.9446 353.9195 366.1275 380.9973 449.7754 462.0050 475.4573 507.4827 546.6792 630.2477 690.2810 714.6150 771.0649 793.1589 825.7027 832.6798 861.4745 863.7739 889.7462 920.8859 956.1299 1006.4350 1010.8247 1028.8535 1046.4748 1055.2284 1087.7441 1096.6833 1112.3475 1139.0933 1154.1776 1173.0822 1194.4815 1218.3907 1244.3299 1255.3379 1258.3441 1274.2827 1303.4573 1323.9419 1330.3950 1334.1866 1347.8146 1353.7436 1361.2724 1368.5850 1376.4015 1437.6807 1453.4601 1457.5267 1458.4743 1458.7104 1464.1805 1470.6647 1477.0176 1504.7309 1622.8174 2948.3483 2964.3079 2969.0820 2974.7314 2981.7091 2991.5556 3020.9581 3023.1927 3026.2737 3028.9059 3036.6403 3043.4174 3057.7626 3061.2332 3102.9330 3549.1042 3560.4636
redmass: 4.5621 3.8727 5.4620 5.4724 3.4200 3.4963 3.5916 2.5193 2.3890 5.7856 1.6786 1.4316 1.8391 2.2900 3.0252 2.5258 2.1046 2.2657 1.3486 2.6203 3.7247 8.7025 1.5168 3.3661 2.0979 2.4300 2.1788 2.5559 2.3077 1.4293 2.5249 2.8557 2.5522 2.5207 1.4406 1.8183 1.6977 1.9886 1.0428 2.4225 1.7319 1.8142 1.4141 1.4379 1.3447 1.2849 1.2958 1.3298 1.7146 1.4692 1.3560 1.4118 1.4372 1.4552 1.2674 1.3070 1.3429 1.1467 1.2942 1.1157 1.0981 1.1634 1.0958 1.0953 1.1474 2.2612 5.0776 1.0672 1.0625 1.0644 1.0638 1.0620 1.0626 1.0573 1.0877 1.0939 1.0946 1.1006 1.1018 1.0982 1.0985 1.1115 1.0772 1.0770
irintensity: 0.5300 0.0804 1.4027 14.0101 9.9223 11.3427 3.0953 0.3327 0.7974 11.6273 4.3147 5.5275 18.1835 3.9668 3.5949 3.7773 1.5437 11.7801 214.9429 4.6930 0.3589 9.2327 1.2674 1.2521 16.7923 10.4702 16.2557 7.6766 6.8786 7.5210 30.8259 5.2081 29.8320 11.1334 0.6952 0.5618 1.3039 3.1988 1.2135 8.9024 4.4795 2.1365 5.2332 66.8905 14.1112 153.5814 11.2643 1.8111 32.0632 10.2100 5.6831 1.0147 2.0815 1.6835 8.1876 0.5853 1.4654 42.7822 69.3006 17.0164 9.6231 5.5921 10.4593 16.1747 29.3747 599.8656 169.0800 35.1473 36.5343 28.1496 26.9155 28.4315 51.9234 43.7454 53.8010 82.7749 28.0395 34.5684 82.2001 40.5758 9.7809 43.4486 15.5525 18.8243
temp: 298.150 k
press: 1.00000 atm
elementType: 9 8 7 7 6 6 6 6 6 6 6 6 6 1 1 1 1 1 1 1 1 1 1 1 1 1 1 1 1 1
symmnumber: 1
zpe: 678983.1 jmol-1
zpe.correction: 0.258611 hartree
zpe.thermalcorrener: 0.272410 hartree
zpe.thermalcorrenthalpy: 0.273354 hartree
zpe.thermalcorrgfe: 0.216376 hartree
zpe.sumelectzpe: -636.704280 hartree
zpe.sumelectthermal: -636.690482 hartree
zpe.sumelectthermalent: -636.689537 hartree
zpe.sumelectthermalfe: -636.746516 hartree
dipole: -1.4024 1.7179 -0.7171
dipole: 2.3307
quadrupole: -74.1811 -85.2835 -78.5260
quadrupole: -6.8629 -0.6087 2.0057
quadrupole: 5.1491 -5.9533 0.8042 -6.8629 -0.6087 2.0057
hfenergy: -636.9628915 hartree
pointgroup: C01 [X(C9H17F1N2O1)]
dipole: -0.5227191 -0.7498246 0.0731213 debye
polarizability: 140.1260827|4.0227152|105.2466446|6.297121|0.7968897|93.294365 unknown
InChI: InChI=1S/C9H17FN2O/c10-6-7-11-9(13)12-8-4-2-1-3-5-8/h8,11-12H,1-7H2
charge 0 multiplicity 1
30 atoms
F  4.638567 -1.32891 0.102412
O  0.96004 1.851674 -0.127613
N  -0.208834 -0.16983 -0.265493
N  2.007337 -0.1391 0.530426
C  -1.442507 0.456168 -0.793562
C  -2.291152 -0.609683 -1.530456
C  -2.272932 1.142883 0.32661
C  -2.935898 -1.633871 -0.561673
C  -2.905795 0.12046 1.298129
C  -3.761474 -0.923153 0.538845
C  0.915588 0.588555 0.034568
C  3.265302 0.528943 0.859646
C  4.403595 0.119381 -0.069908
H  -1.115677 1.234811 -1.507403
H  -1.672269 -1.122165 -2.292286
H  -3.099566 -0.081042 -2.072912
H  -3.076187 1.735715 -0.157906
H  -1.621732 1.855844 0.863245
H  -2.154228 -2.261267 -0.080801
H  -3.576255 -2.332519 -1.13364
H  -3.525051 0.647797 2.048859
H  -2.103207 -0.399235 1.861246
H  -4.624512 -0.409715 0.065818
H  -4.17908 -1.668035 1.243724
H  -0.225468 -1.168649 -0.056454
H  1.999696 -1.159712 0.543309
H  3.082222 1.615472 0.763812
H  3.557231 0.314147 1.906126
H  5.351554 0.624323 0.18962
H  4.145791 0.271312 -1.132186
