program: Gaussian 09
title: 000258690
version: EM64L-G09RevD.01
frameworkgroup: C1[X(C10H12N2)]
method: RPBEPBE
basis: SDD
operation: Freq
keyword: #pfreq=noraman
keyword: PBEPBE/SDD
title: #p freq=noraman PBEPBE/SDD
converged: YES YES NO NO
title: Mulliken charges:
elementType: N N C C C C C C C C C C H H H H H H H H H H H H
charge: -0.171036 -0.549947 0.264990 -0.393637 0.283330 -0.215439 -0.427269 -0.395271 -0.343876 -0.402615 -0.232253 -0.246514 0.209387 0.213297 0.247232 0.253237 0.234633 0.226171 0.227488 0.237036 0.218609 0.219558 0.272226 0.270663
chargesum: 0.00000
title: Mulliken charges with hydrogens summed into heavy atoms:
elementType: N N C C C C C C C C C C
charge: -0.171036 -0.007058 0.264990 0.029047 0.283330 0.031793 -0.174032 0.065534 -0.116388 -0.165579 -0.013644 -0.026956
polarizability: 1.58429830e+02 1.18123537e+01 1.35350633e+02 1.23071084e+01 -5.07116219e+00 6.31863730e+01
1716.lowfreq: -12.3890 -6.6437 -0.0004 0.0004 0.0006 6.8498 40.8133 66.7937 88.5702
frequency: 40.6336 66.7680 88.5522 204.9720 216.0563 245.3376 275.3016 299.7085 360.3376 422.8656 457.2273 464.0804 540.5866 575.6660 587.1401 609.8854 728.5392 741.0593 746.1702 748.4292 769.6296 773.8678 846.2729 856.1791 873.3601 929.6967 943.6529 969.3611 998.5714 1011.4771 1019.9255 1081.3524 1107.4576 1116.4592 1145.3049 1167.2631 1205.6932 1236.6949 1273.8986 1303.0785 1315.7388 1324.0869 1351.7959 1359.1910 1366.6666 1416.3984 1455.3980 1466.8463 1470.0963 1481.0370 1512.1944 1581.1121 1623.5336 1641.5691 2989.4955 3002.4576 3041.9026 3070.5009 3122.0849 3130.7537 3144.4515 3161.7796 3204.4942 3231.7223 3495.2550 3625.3869
redmass: 3.5663 4.3543 1.7801 3.7466 4.0725 1.9551 1.2756 2.5726 4.6605 2.8149 2.1963 1.9713 5.8528 4.0240 3.9911 4.4762 1.4105 4.2316 2.3652 1.4957 1.5489 2.1557 1.3676 1.4723 4.9966 1.3849 1.2768 1.3027 5.3021 2.0757 1.8618 1.8889 4.3277 1.3777 1.5556 1.1381 1.7170 1.7877 1.4277 1.3089 2.2374 1.1454 1.9626 1.3111 3.6266 3.6376 1.4543 2.2916 1.7676 1.4269 4.3482 6.6412 7.3317 1.0940 1.0593 1.0603 1.1029 1.1071 1.0846 1.0888 1.0953 1.1002 1.0902 1.1063 1.0444 1.0997
irintensity: 1.0520 0.9240 1.6429 1.3035 5.5593 19.9210 27.7926 19.0098 6.7109 8.5402 173.4233 202.7899 1.2121 3.3820 2.5920 0.4972 10.4498 12.2726 5.6987 125.0834 2.5022 34.3958 0.0975 6.2404 2.8088 4.4031 1.4589 0.1610 11.2326 8.4630 7.7837 7.9847 34.2666 7.0903 12.0572 3.5420 8.6966 22.2662 0.8196 11.7425 34.8249 0.9286 5.7472 0.7730 21.0907 13.6791 27.8374 21.2877 4.0879 22.9418 26.0545 0.2253 3.3997 42.4753 19.2911 67.1771 0.3960 37.8603 1.1469 5.4095 41.7120 29.9411 0.5423 5.4590 2.3099 2.6663
temp: 298.150 k
press: 1.00000 atm
elementType: 7 7 6 6 6 6 6 6 6 6 6 6 1 1 1 1 1 1 1 1 1 1 1 1
symmnumber: 1
zpe: 524170.5 jmol-1
zpe.correction: 0.199646 hartree
zpe.thermalcorrener: 0.210437 hartree
zpe.thermalcorrenthalpy: 0.211381 hartree
zpe.thermalcorrgfe: 0.162599 hartree
zpe.sumelectzpe: -496.888199 hartree
zpe.sumelectthermal: -496.877408 hartree
zpe.sumelectthermalent: -496.876464 hartree
zpe.sumelectthermalfe: -496.925246 hartree
dipole: 2.5011 0.1111 1.3701
dipole: 2.8540
quadrupole: -63.6374 -64.3498 -77.9585
quadrupole: 1.7634 8.6862 -3.0598
quadrupole: 5.0112 4.2988 -9.3100 1.7634 8.6862 -3.0598
hfenergy: -497.0878446 hartree
pointgroup: C01 [X(C10H12N2)]
dipole: -0.9735304 -0.0057815 0.5594247 debye
dipolederiv: -0.8415513 0.0076436 0.0464242 0.3914078 -0.470833 -0.0645182 0.1403555 0.0149336 -0.2172269 -0.8823209 0.2840708 -0.1925994 0.3739292 -0.3081054 0.1346646 -0.353701 0.1656925 -0.679132 0.5376553 0.3281923 -0.0286807 0.162296 -0.1680903 -0.0197445 -0.0843981 -0.0948487 0.0271601 0.5886898 -0.0513251 -0.060946 -0.1558998 0.1901851 0.030733 -0.2701784 0.0480382 0.1937735 -0.1730197 -0.0029024 0.0296832 0.420289 0.162929 -0.049776 0.0905449 0.0109332 0.0111714 0.1685311 -0.2895116 -0.103794 -0.5482616 0.2758199 0.1247638 -0.1586921 0.1129428 -0.1280739 -0.3719551 0.099173 -0.0119074 -0.0896387 -0.0270901 0.052907 0.0108038 0.0069596 -0.2731245 0.6288609 -0.2017014 0.0687073 -0.2372641 0.2528869 -0.0347375 0.1313667 -0.009501 0.2786573 -0.0546044 0.0378755 -0.026007 -0.0528084 0.0922409 0.0267852 -0.0484777 0.0249613 -0.175798 0.0906582 0.0158993 -0.0606091 -0.0505364 0.0973997 0.0454825 -0.065341 0.028797 -0.156664 -0.0071228 -0.1093818 -0.0490706 -0.0426369 0.0573346 0.0392634 -0.0488342 0.0519022 -0.1754 0.0330476 0.048494 -0.0530927 0.0200725 -0.1517329 0.0019179 -0.04919 -0.0069552 -0.1764336 -0.0757409 -0.0415713 0.071079 -0.1023335 -0.0354825 0.1098165 0.0436578 0.0526684 0.0227772 0.0156131 -0.0206258 -0.0402016 0.0753904 -0.0558644 -0.1385554 -0.002226 -0.070807 -0.0220153 0.0005791 -0.1008984 0.0375297 -0.0631269 0.0551478 -0.0054049 0.0404615 0.0045873 0.1842835 0.068301 0.0689967 0.036146 0.0271245 -0.0431908 -0.0344228 0.038902 -0.0427428 0.1892337 -0.0388484 -0.0590993 0.0646405 -0.0808282 -0.0079345 0.0870818 0.044208 0.0518379 0.0233323 0.0448348 0.0205861 -0.0263336 0.0269491 -0.0787971 -0.123633 -0.0235168 -0.0759979 -0.0184336 -0.0273953 0.1168701 0.0572392 0.0883457 0.0072408 -0.0321752 0.0564237 -0.0419606 0.1461277 -0.0290495 0.0729286 0.0508476 0.1108354 -0.0018365 -0.0451296 0.0581687 -0.037227 0.1439405 0.0721246 -0.0489786 0.0128984 -0.0609325 -0.131762 -0.0254329 0.0144047 -0.0240756 0.1569901 -0.1240216 -0.078941 0.0549917 -0.0824892 0.0574791 0.0053325 0.0566298 0.0060388 0.1539765 0.1793595 -0.0697956 0.0245151 -0.0582222 0.1391611 -0.1137866 0.1294024 -0.2057777 0.2269837 0.1973749 -0.0259977 0.0985401 -0.0716613 0.0928948 0.0285684 0.2492258 0.0296008 0.2638942 unknown
polarizability: 158.7121581|11.0014496|134.5632273|-14.1420331|5.0139381|63.691451 unknown
InChI: InChI=1S/C10H12N2/c11-6-8-12-7-5-9-3-1-2-4-10(9)12/h1-5,7H,6,8,11H2
charge 0 multiplicity 1
24 atoms
N  -0.824119 -0.623078 0.42926
N  -4.191378 1.073318 -0.302593
C  0.372722 0.084314 0.226923
C  -2.13476 -0.027761 0.717087
C  1.391943 -0.87331 -0.129044
C  -0.576791 -1.986745 0.194205
C  0.761852 -2.176682 -0.142312
C  -2.882338 0.469096 -0.563634
C  0.644705 1.467782 0.335846
C  2.71269 -0.412809 -0.37692
C  1.964618 1.894094 0.084796
C  2.987828 0.963888 -0.268415
H  -2.76008 -0.780023 1.233912
H  -2.003191 0.821011 1.415507
H  -1.379602 -2.716283 0.296401
H  1.235308 -3.131064 -0.365455
H  -2.245416 1.203972 -1.089816
H  -3.009481 -0.385383 -1.254465
H  -0.133416 2.191114 0.603759
H  3.505448 -1.118943 -0.648269
H  2.20987 2.959495 0.160271
H  4.002037 1.333182 -0.457458
H  -4.186551 1.980855 0.166127
H  -4.922299 0.443559 0.033085
