program: Gaussian 09
title: 000258712
version: EM64L-G09RevD.01
frameworkgroup: C1[X(C12H17N5O2S)]
method: RPBEPBE
basis: SDD
operation: Freq
keyword: #p
keyword: freq=noraman
keyword: PBEPBE/SDD
title: #p freq=noraman PBEPBE/SDD
converged: YES YES NO NO
title: Mulliken charges:
elementType: S O O N N N N N C C C C C C C C C C C C H H H H H H H H H H H H H H H H H
charge: 0.507715 -0.360606 -0.257282 -0.142131 -0.177393 -0.485213 -0.442367 -0.353696 -0.448548 -0.458518 -0.448834 -0.455669 -0.354490 -0.328306 -0.343568 -0.389825 0.286505 0.261540 -0.069755 0.245278 0.233620 0.227352 0.235702 0.226035 0.229402 0.222839 0.229915 0.224738 0.240295 0.259689 0.242256 0.264161 0.228040 0.256936 0.233891 0.242282 0.418010
chargesum: 0.00000
title: Mulliken charges with hydrogens summed into heavy atoms:
elementType: S O O N N N N N C C C C C C C C C C C C
charge: 0.507715 -0.360606 -0.257282 -0.142131 -0.177393 -0.067203 -0.442367 -0.353696 0.012423 0.003219 0.003408 -0.001015 0.145494 0.178111 0.141408 0.086348 0.286505 0.261540 -0.069755 0.245278
polarizability: 2.57716294e+02 -4.96348547e+00 2.24382070e+02 3.83327908e-01 -3.93526107e-02 1.06501225e+02
1716.lowfreq: -8.6194 -4.3613 -1.3077 -0.0015 0.0009 0.0010 14.2114 23.7164 50.5176
frequency: 13.6989 23.5669 50.4761 57.5809 73.2381 85.2157 100.3827 123.5421 136.8951 180.4961 188.2120 198.8135 205.4059 240.4520 243.0890 259.5309 279.3475 310.0485 316.3098 381.8861 414.3030 471.7824 476.2613 532.9914 566.6031 570.0712 590.3948 636.8606 652.6316 693.1176 703.2124 705.8426 720.1765 767.4049 782.7124 818.9197 848.2431 858.5566 864.0946 865.4367 884.0590 903.7430 913.3619 915.5702 919.3486 927.1034 976.7245 982.6579 1028.4542 1058.0549 1072.1053 1107.7033 1117.2769 1139.8798 1145.1521 1156.3702 1167.1618 1175.2236 1178.5065 1183.4563 1214.9525 1223.2210 1227.6274 1239.0241 1245.6972 1303.5042 1303.9680 1312.9954 1313.6652 1323.1584 1333.3677 1336.3012 1340.2651 1354.7313 1379.5670 1401.9172 1464.1680 1468.3080 1470.1339 1473.1354 1478.0314 1480.7718 1490.4067 1491.7685 1499.5773 1525.4602 1580.0026 1634.2060 2958.7976 2979.2981 2995.6854 3008.2807 3009.9933 3010.6530 3011.4734 3013.8334 3027.2160 3065.2269 3072.2099 3078.5229 3081.7893 3089.8368 3092.1507 3099.9578 3158.0764
redmass: 4.4295 4.1412 3.9651 3.8691 2.9734 3.8941 3.5822 6.1059 5.6497 5.8909 7.2220 4.9626 3.4949 1.7392 1.7207 3.2364 5.7702 7.8909 6.2917 12.1819 10.4513 11.0592 7.1956 7.2026 2.0583 1.9244 6.5350 8.6097 10.7962 4.2518 6.5806 9.8221 4.1181 7.9358 3.0311 2.3241 2.0486 2.2549 1.9404 1.9568 1.1821 3.4870 2.5228 1.9450 1.6980 1.5231 1.8137 1.9121 3.8087 1.9623 1.9476 1.5738 1.6654 2.8992 2.9151 1.6614 1.5499 1.6132 1.8792 2.4905 1.8598 1.3157 2.2397 1.2602 1.2935 1.3274 1.3506 1.2341 1.2503 1.5461 1.5383 1.5753 1.5170 4.5922 6.3803 6.6050 1.3601 1.0881 1.0887 1.0964 1.0864 1.9042 1.0886 1.2687 1.1350 5.6039 3.4557 3.7224 1.0621 1.0678 1.0658 1.0705 1.0692 1.0631 1.0629 1.0622 1.0936 1.0960 1.0976 1.1010 1.0986 1.1006 1.1055 1.1042 1.0817
irintensity: 1.0315 1.4567 1.6969 1.3221 0.3545 2.1484 0.3736 0.8375 1.1454 0.6501 2.8471 1.2763 2.2538 0.1121 0.3764 7.8459 15.0452 1.5309 7.2374 3.6046 14.5810 12.1282 2.0670 15.9973 4.1346 1.9734 2.1973 5.5541 4.2452 26.4387 47.7442 10.4033 13.5355 0.1321 9.8143 2.8904 10.4280 11.3138 4.5083 0.8509 78.6705 11.7955 10.9156 10.6980 3.0737 5.4796 3.2472 9.4174 0.9874 3.0577 7.8133 2.1948 6.2830 4.7607 7.5585 11.1017 18.4480 2.4521 12.5421 16.6033 58.1672 34.4734 6.3122 4.2593 7.3628 1.6572 2.8580 1.6630 0.0074 1.1222 2.1349 55.9732 52.0470 454.7224 30.2553 128.3256 274.3685 8.3696 12.9340 24.1360 5.7904 229.5040 17.1915 38.4780 25.6892 831.3679 73.0491 292.2232 37.8168 42.3551 22.6851 21.4059 15.3892 32.7377 29.5780 30.4303 34.7316 17.5543 12.8141 31.2027 23.9866 16.0664 60.5321 47.7640 375.4391
temp: 298.150 k
press: 1.00000 atm
elementType: 16 8 8 7 7 7 7 7 6 6 6 6 6 6 6 6 6 6 6 6 1 1 1 1 1 1 1 1 1 1 1 1 1 1 1 1 1
symmnumber: 1
zpe: 769334.3 jmol-1
zpe.correction: 0.293024 hartree
zpe.thermalcorrener: 0.311918 hartree
zpe.thermalcorrenthalpy: 0.312862 hartree
zpe.thermalcorrgfe: 0.242955 hartree
zpe.sumelectzpe: -1288.240935 hartree
zpe.sumelectthermal: -1288.222041 hartree
zpe.sumelectthermalent: -1288.221097 hartree
zpe.sumelectthermalfe: -1288.291004 hartree
dipole: -4.0696 -6.5882 0.0038
dipole: 7.7438
quadrupole: -98.3296 -131.3990 -123.2232
quadrupole: -10.2109 -1.1267 -0.6504
quadrupole: 19.3210 -13.7484 -5.5726 -10.2109 -1.1267 -0.6504
hfenergy: -1288.5339589 hartree
pointgroup: C01 [X(C12H17N5O2S1)]
dipole: 1.5184426 -2.5934292 0.5003963 debye
polarizability: 253.5879255|-3.2951106|214.4266913|-25.385034|-31.7819844|120.5849724 unknown
InChI: InChI=1S/C12H17N5O2S/c18-11(16-5-1-2-6-16)9-10(15-20-14-9)13-12(19)17-7-3-4-8-17/h13H,1-8H2
charge 0 multiplicity 1
37 atoms
S  1.294072 3.155075 -1.498263
O  0.418141 -1.424065 0.061029
O  -3.144886 2.037495 -0.569763
N  2.643833 -1.205875 -0.504366
N  -3.517485 -0.131272 0.204954
N  -1.331492 0.524715 -0.308712
N  2.071799 1.581887 -1.16143
N  -0.373238 2.619038 -1.081307
C  4.424593 -2.733326 -0.061116
C  4.858499 -1.763697 -1.189153
C  -5.413155 -1.092824 1.262083
C  -4.445962 -2.229097 0.836848
C  2.885605 -2.611145 -0.058949
C  3.883651 -0.571834 -1.04492
C  -4.973098 0.09904 0.381134
C  -3.099221 -1.497846 0.611633
C  1.385678 -0.686127 -0.38902
C  -2.703437 0.896747 -0.248489
C  1.101704 0.736561 -0.76686
C  -0.274018 1.317299 -0.716563
H  4.755928 -3.770636 -0.233627
H  4.834476 -2.399022 0.909545
H  5.910145 -1.443469 -1.104426
H  4.725135 -2.244587 -2.175769
H  -6.473734 -1.354818 1.11069
H  -5.267947 -0.848461 2.330543
H  -4.360394 -3.030813 1.589542
H  -4.790472 -2.682371 -0.110706
H  2.408669 -3.311891 -0.771184
H  2.418602 -2.777176 0.926007
H  4.258263 0.189486 -0.336207
H  3.67546 -0.053159 -1.993014
H  -5.486681 0.097173 -0.60093
H  -5.147311 1.085632 0.842585
H  -2.496949 -1.46765 1.543039
H  -2.489367 -1.990147 -0.169302
H  -1.003106 -0.426838 -0.032159
