program: Gaussian 09
title: 000258728
version: EM64L-G09RevD.01
frameworkgroup: C1[X(C21H25NO2)]
method: RPBEPBE
basis: SDD
operation: Freq
keyword: #p
keyword: freq=noraman
keyword: PBEPBE/SDD
title: #p freq=noraman PBEPBE/SDD
converged: YES YES NO NO
title: Mulliken charges:
elementType: O O N C C C C C C C C C C C C C C C C C C C C C H H H H H H H H H H H H H H H H H H H H H H H H H
charge: -0.433714 -0.247862 -0.103282 -0.405477 -0.123449 -0.471280 0.263665 0.334305 -0.352931 0.306431 0.311544 -0.756893 -0.330538 -0.342445 -0.469355 -0.429770 -0.324714 -0.318757 -0.415644 -0.414968 -0.249685 -0.252233 -0.241965 -0.245309 0.240836 0.265866 0.213072 0.222499 0.192394 0.222805 0.233477 0.245742 0.188527 0.213916 0.218256 0.188184 0.279891 0.246878 0.193193 0.212122 0.211991 0.191703 0.237361 0.236259 0.342586 0.230881 0.228769 0.228914 0.228201
chargesum: 0.00000
title: Mulliken charges with hydrogens summed into heavy atoms:
elementType: O O N C C C C C C C C C C C C C C C C C C C C C
charge: -0.091129 -0.247862 -0.103282 -0.164640 0.142418 -0.035709 0.263665 0.334305 0.062267 0.306431 0.311544 -0.277673 0.071905 0.063995 -0.189464 -0.182891 0.080601 0.084937 -0.178283 -0.178708 -0.018804 -0.023464 -0.013051 -0.017108
polarizability: 2.48683513e+02 -3.73674121e+01 2.41064960e+02 -3.09206026e+01 -1.82346310e+01 1.91372924e+02
1716.lowfreq: -16.6096 -0.0004 -0.0003 0.0005 6.0545 7.5677 11.9653 22.7620 47.0699
frequency: 7.0186 22.5268 46.8778 52.1569 62.9462 76.8876 101.9789 136.9072 139.6127 173.5430 201.2717 231.2701 243.4680 250.9117 266.2165 282.9692 324.8509 330.8160 354.5615 374.0521 380.2246 398.1414 406.1635 434.0058 446.8473 454.1646 468.2648 468.8342 507.9345 515.2706 555.9814 583.5213 598.2490 618.4034 635.5952 676.2734 707.9830 731.9844 736.0842 741.4761 761.8004 777.7778 787.4288 801.8945 810.8943 840.3893 854.5828 870.9676 878.1374 887.2495 895.5482 922.1471 933.8855 943.0641 956.9777 970.4000 981.0979 986.7280 988.8546 1019.6303 1026.8933 1037.0059 1040.8910 1048.9998 1056.0434 1080.3992 1086.1352 1094.3094 1105.2601 1121.6867 1123.7985 1139.9869 1173.1642 1174.2752 1177.2987 1183.6662 1187.7036 1193.0381 1197.4430 1207.1034 1211.9989 1220.0933 1227.8898 1238.2621 1265.8547 1275.2090 1282.9786 1284.7783 1293.8746 1308.1182 1320.6943 1329.1494 1342.4637 1346.2381 1358.0599 1366.9901 1370.3901 1381.6286 1382.7988 1385.8366 1391.9881 1435.4673 1443.1118 1445.5511 1447.8744 1449.1012 1450.1038 1456.7784 1463.7505 1474.8282 1482.4770 1491.5055 1584.0547 1600.9487 1608.3717 1616.4682 2854.3958 2855.7494 2870.8521 2939.0722 2952.3649 2956.2407 2982.6129 2989.6043 3017.7074 3028.7754 3030.7250 3035.2378 3048.2621 3058.5985 3078.7825 3082.0382 3113.0537 3113.5016 3118.0461 3122.1188 3137.9112 3138.9477 3159.8781 3160.4126 3502.9329
redmass: 4.4125 5.7019 3.4316 4.4958 4.4118 4.1950 4.7314 3.9484 4.3162 3.6682 3.5213 4.2189 1.8578 2.6551 4.3316 2.7884 3.4060 2.4846 4.2939 4.8114 2.9667 1.7390 1.7351 2.4360 2.7133 2.5710 3.1464 2.7728 3.6232 4.1359 4.2404 1.9920 4.6526 5.4525 4.5402 4.3604 4.0312 2.6451 3.5331 1.6679 1.2371 3.3680 2.3770 3.8373 3.3296 1.5862 2.8820 1.4880 1.4847 3.3927 2.3772 2.3901 1.7917 1.9809 1.6574 1.7302 2.6881 1.3461 1.3158 2.4164 2.1657 2.4687 2.1710 2.7059 1.8668 3.2521 2.2613 2.6539 2.2767 1.9217 1.9619 2.1599 1.0845 1.0681 2.9152 1.3130 1.2214 1.2304 1.6251 1.5176 2.3057 1.3063 1.3226 1.3113 1.3198 1.4409 1.4099 1.4247 1.3335 1.5404 1.7935 1.3100 1.2363 1.4303 1.4843 1.4418 1.2711 1.9347 4.0759 1.4426 2.2745 2.2046 1.0817 1.1275 1.1064 2.1378 1.1688 1.0992 1.1105 1.0999 2.4842 2.3963 6.3712 7.2480 6.3515 6.5120 1.0711 1.0702 1.0692 1.0678 1.0665 1.0665 1.0628 1.0835 1.0902 1.0897 1.0896 1.0890 1.0890 1.0922 1.0962 1.0977 1.0868 1.0872 1.0892 1.0883 1.0928 1.0930 1.1004 1.1004 1.0654
irintensity: 0.1940 0.1139 0.0954 0.4605 0.2005 0.4887 0.8834 2.3775 0.6975 0.4707 0.9335 0.8005 1.4754 7.1551 3.9990 5.2249 7.1220 5.6719 3.5925 0.1956 0.5380 43.2677 134.8189 30.2574 11.0330 17.3520 2.4345 0.4970 2.5471 0.5948 5.0664 10.3592 19.5007 1.9407 7.3790 7.8340 3.7311 20.5212 6.0623 63.1551 4.7644 3.4201 35.9306 15.7204 3.6109 0.0357 7.9639 0.3447 0.1733 3.1630 13.6672 21.1987 8.3025 18.9327 8.3681 7.2036 17.8323 0.6298 0.1421 34.0428 13.6757 2.0815 8.9377 52.8746 3.9175 27.7574 0.3426 8.3217 1.1838 28.1397 31.4928 71.0428 0.0096 0.1541 0.5708 4.7730 2.1998 5.3593 5.1538 0.0672 0.5528 11.4506 4.1561 2.4758 7.0437 11.5488 17.7237 6.6591 5.7843 1.5311 7.9037 6.0745 12.3885 3.3916 2.8329 1.0928 2.3220 15.3121 4.1054 1.7278 6.3092 8.4360 2.3631 14.0365 3.7577 1.9077 21.6605 2.7094 7.0469 12.2950 57.8853 2.5756 5.8044 0.1971 0.0758 0.7052 29.5346 41.3621 218.3354 17.7144 31.7704 93.5568 27.3411 12.6115 19.1433 19.4119 23.0737 30.3877 22.0646 35.0351 42.3562 39.2556 3.1170 16.5791 2.3475 2.7057 19.7628 26.4663 55.1129 11.4140 5.9999
temp: 298.150 k
press: 1.00000 atm
elementType: 8 8 7 6 6 6 6 6 6 6 6 6 6 6 6 6 6 6 6 6 6 6 6 6 1 1 1 1 1 1 1 1 1 1 1 1 1 1 1 1 1 1 1 1 1 1 1 1 1
symmnumber: 1
zpe: 1085337.8 jmol-1
zpe.correction: 0.413383 hartree
zpe.thermalcorrener: 0.434321 hartree
zpe.thermalcorrenthalpy: 0.435266 hartree
zpe.thermalcorrgfe: 0.361620 hartree
zpe.sumelectzpe: -1018.643705 hartree
zpe.sumelectthermal: -1018.622767 hartree
zpe.sumelectthermalent: -1018.621823 hartree
zpe.sumelectthermalfe: -1018.695468 hartree
dipole: 2.3835 0.1287 -1.8116
dipole: 2.9966
quadrupole: -154.4126 -135.4493 -138.0362
quadrupole: -2.6447 -7.3159 -1.2566
quadrupole: -11.7799 7.1834 4.5965 -2.6447 -7.3159 -1.2566
hfenergy: -1019.0570886 hartree
pointgroup: C01 [X(C21H25N1O2)]
dipole: -0.9391642 -0.009733 0.7126374 debye
polarizability: 246.4568506|38.901094|241.6524733|-29.7068713|19.5841059|193.0120728 unknown
InChI: InChI=1S/C21H25NO2/c23-20(9-10-22-11-13-24-14-12-22)21-18-7-3-1-5-16(18)15-17-6-2-4-8-19(17)21/h1-8,20-21,23H,9-15H2
charge 0 multiplicity 1
49 atoms
O  -0.090443 -2.423114 -1.354128
O  5.609637 0.114316 0.21922
N  2.961842 -1.077333 0.355074
C  -1.131196 -0.152537 -1.095163
C  0.10502 -1.081115 -0.771467
C  0.475166 -1.188476 0.721077
C  -2.423779 -0.686418 -0.489153
C  -0.837521 1.287726 -0.692056
C  1.843209 -1.880763 0.908598
C  -2.934891 -0.160537 0.729089
C  -1.351194 1.830188 0.516522
C  -2.224453 0.985702 1.435067
C  3.329217 0.08193 1.206765
C  4.162895 -1.898138 0.055996
C  -3.129376 -1.733248 -1.140716
C  -0.014739 2.09383 -1.519026
C  4.414279 0.92234 0.513856
C  5.233533 -1.03154 -0.626741
C  -4.12236 -0.705495 1.276522
C  -1.033656 3.165847 0.867707
C  -4.305844 -2.278981 -0.581641
C  0.30638 3.419361 -1.15871
C  -4.801516 -1.766511 0.639293
C  -0.20657 3.959476 0.044416
H  -1.218965 -0.20201 -2.198836
H  0.980897 -0.687331 -1.31608
H  -0.301447 -1.76711 1.261866
H  0.49638 -0.178268 1.169991
H  2.001696 -2.113513 1.992134
H  1.816679 -2.842878 0.363588
H  -2.968355 1.630368 1.940351
H  -1.593158 0.569957 2.250814
H  3.70608 -0.253807 2.206992
H  2.43953 0.716532 1.373465
H  3.870611 -2.72334 -0.620505
H  4.598651 -2.348521 0.984107
H  -2.768298 -2.093759 -2.11133
H  0.371319 1.675465 -2.456961
H  4.005572 1.34714 -0.428719
H  4.764832 1.738344 1.167378
H  6.165532 -1.598983 -0.785881
H  4.846144 -0.664988 -1.602067
H  -4.521665 -0.288904 2.209901
H  -1.441888 3.58744 1.794928
H  -0.876548 -2.838991 -0.910187
H  -4.837413 -3.084992 -1.099464
H  0.941445 4.028706 -1.811199
H  -5.717537 -2.175743 1.079578
H  0.028064 4.990577 0.331236
