program: Gaussian 09
title: 000258596
version: EM64L-G09RevD.01
frameworkgroup: C1[X(C11H11ClN4)]
method: RPBEPBE
basis: SDD
operation: Freq
keyword: #p
keyword: freq=noraman
keyword: PBEPBE/SDD
title: #p freq=noraman PBEPBE/SDD
converged: NO NO NO NO
title: Mulliken charges:
elementType: Cl N N N N C C C C C C C C C C C H H H H H H H H H H H
charge: -0.041421 -0.371770 -0.055824 -0.650601 0.032030 -0.467877 0.394418 0.209665 -0.387300 -0.387056 0.140298 -0.223699 -0.223685 -0.232812 -0.252828 -0.361567 0.240522 0.240382 0.360611 0.238667 0.238710 0.229452 0.229441 0.231968 0.249313 0.310467 0.310495
chargesum: 0.00000
title: Mulliken charges with hydrogens summed into heavy atoms:
elementType: Cl N N N N C C C C C C C C C C C
charge: -0.041421 -0.011160 -0.055824 -0.029639 0.032030 0.013027 0.394418 0.209665 -0.148633 -0.148346 0.140298 0.005753 0.005756 -0.000844 -0.252828 -0.112254
polarizability: 2.27888376e+02 -1.40687805e+01 1.34503622e+02 1.72120587e-02 1.07095936e-01 1.09432110e+02
1716.lowfreq: -248.8591 -24.4091 -5.0453 -0.0017 0.0012 0.0017 5.2327 10.1886 22.1388
frequency: -248.8582 -24.1852 21.2661 49.2045 68.4735 137.3795 144.8723 201.3912 208.9554 233.6034 296.1277 315.0472 331.4885 364.0259 403.8290 482.2150 503.8956 518.2863 546.4040 594.4799 614.7797 617.6835 654.0622 676.1401 704.1756 721.5290 758.3782 761.3053 783.9687 828.2859 855.9959 903.4126 935.4905 936.3681 943.8731 978.5756 990.3920 997.7674 1026.6343 1069.7854 1087.0658 1117.4182 1155.6516 1157.5184 1173.4565 1187.5511 1206.7557 1218.9835 1277.3182 1317.4899 1324.9846 1333.7814 1377.4408 1383.4313 1387.7124 1439.0325 1451.5296 1483.3329 1488.2573 1538.5774 1559.5533 1594.3911 1615.9089 1635.2880 2989.5233 3036.2070 3120.3561 3121.3756 3134.8082 3147.7786 3164.3220 3165.9759 3443.6775 3487.6850 3553.7619
redmass: 1.0464 4.0091 4.3454 6.2881 5.9215 6.3295 4.9157 8.9952 7.1187 5.2167 4.1948 2.2516 4.1153 14.8762 2.8070 4.0667 3.4555 7.0469 3.9043 5.8820 6.6127 6.3902 2.1311 1.1541 1.8692 2.5314 1.8784 7.3485 10.0484 4.1802 1.2442 2.5875 2.0395 1.4523 1.6079 1.3891 6.2848 1.3164 2.2453 7.2097 1.5231 3.8419 1.2933 4.9602 1.0536 1.1178 1.1083 2.3990 6.4568 1.9771 1.2710 2.3652 1.8024 8.3890 1.8242 2.1789 4.1452 1.5253 1.4721 7.0975 5.6310 6.0925 6.1663 1.1419 1.0590 1.1036 1.0858 1.0885 1.0915 1.0961 1.1016 1.0924 1.0450 1.0768 1.0969
irintensity: 26.0275 0.5878 1.4352 0.0933 0.2769 0.6790 5.9493 0.0088 3.0846 1.6288 0.8571 1.5825 7.1081 13.8969 0.0191 13.1378 3.3676 2.5812 31.9035 5.8078 2.0903 0.1759 96.6125 72.7358 45.9725 118.0544 34.9486 19.8115 36.2503 8.0869 0.3865 32.7596 37.7472 6.9079 4.3091 0.0363 0.4406 0.5824 12.3691 77.4759 8.4350 2.3118 0.6089 47.7883 0.0254 1.0554 0.2131 1.9246 71.3383 42.2966 0.2333 97.9179 30.4532 0.0667 51.9681 8.5344 76.8380 43.1063 3.2248 26.4297 824.8439 1.0556 3.0031 127.8485 31.8748 13.9877 7.1222 2.6862 12.7631 37.3221 23.1287 18.6017 10.4453 72.9704 15.2322
temp: 298.150 k
press: 1.00000 atm
elementType: 17 7 7 7 7 6 6 6 6 6 6 6 6 6 6 6 1 1 1 1 1 1 1 1 1 1 1
symmnumber: 1
zpe: 538663.2 jmol-1
zpe.correction: 0.205166 hartree
zpe.thermalcorrener: 0.218153 hartree
zpe.thermalcorrenthalpy: 0.219097 hartree
zpe.thermalcorrgfe: 0.163682 hartree
zpe.sumelectzpe: -1103.694118 hartree
zpe.sumelectthermal: -1103.681132 hartree
zpe.sumelectthermalent: -1103.680187 hartree
zpe.sumelectthermalfe: -1103.735602 hartree
dipole: 4.5079 -2.5469 -0.0032
dipole: 5.1776
quadrupole: -112.0143 -97.3299 -93.3858
quadrupole: 0.7198 0.0361 0.0403
quadrupole: -11.1043 3.5801 7.5242 0.7198 0.0361 0.0403
hfenergy: -1103.8992843 hartree
pointgroup: C01 [X(C11H11Cl1N4)]
dipole: -1.8361615 0.8815721 -0.0294573 debye
polarizability: 229.3275717|-7.7299938|133.0441048|1.4318286|-0.386115|109.4524325 unknown
InChI: InChI=1S/C11H11ClN4/c12-10-9(13)11(16-7-15-10)14-6-8-4-2-1-3-5-8/h1-5,7,14H,6,13H2
charge 0 multiplicity 1
27 atoms
Cl 4.887328 1.778631 0.066936
N  0.011699 -0.055982 0.017889
N  1.788343 -1.620601 0.051448
N  1.731508 2.134795 0.023187
N  4.093999 -0.830005 0.075228
C  -1.016711 -1.116704 0.011597
C  -2.408953 -0.504635 -0.005539
C  1.350566 -0.310615 0.03674
C  -3.078987 -0.202274 1.207454
C  -3.052245 -0.208186 -1.234363
C  2.276146 0.803395 0.040224
C  -4.364195 0.385729 1.194346
C  -4.337411 0.379851 -1.252218
C  -4.996161 0.6790 -0.036716
C  3.631433 0.439058 0.060199
C  3.133047 -1.800771 0.069737
H  -0.876347 -1.758659 0.901684
H  -0.85755 -1.766351 -0.869731
H  -0.244056 0.938145 0.007803
H  -2.59335 -0.435054 2.16327
H  -2.545842 -0.445687 -2.178169
H  -4.872471 0.609623 2.138875
H  -4.824876 0.599061 -2.208737
H  -5.99429 1.131169 -0.048741
H  3.490613 -2.834656 0.081393
H  1.951994 2.668264 -0.825469
H  1.93057 2.681557 0.868672
