program: Gaussian 09
title: 000258600
version: EM64L-G09RevD.01
frameworkgroup: C1[X(C14H14N4O2)]
method: RPBEPBE
basis: SDD
operation: Freq
keyword: #p
keyword: freq=noraman
keyword: PBEPBE/SDD
title: #p freq=noraman PBEPBE/SDD
converged: YES YES NO NO
title: Mulliken charges:
elementType: O O N N N N C C C C C C C C C C C C C C H H H H H H H H H H H H H H
charge: -0.226187 -0.443628 -0.258141 -0.018186 -0.042520 -0.066309 0.442231 0.461552 0.105538 -0.551081 -0.344403 -0.372509 -0.085522 -0.403000 -0.430242 -0.235762 -0.319438 0.164018 -0.360252 -0.502333 0.226138 0.208379 0.296156 0.239263 0.238868 0.264041 0.270354 0.225039 0.197829 0.248536 0.350316 0.242310 0.241989 0.236956
chargesum: 0.00000
title: Mulliken charges with hydrogens summed into heavy atoms:
elementType: O O N N N N C C C C C C C C C C C C C C
charge: -0.226187 -0.093312 -0.258141 -0.018186 -0.042520 -0.066309 0.442231 0.461552 0.105538 -0.116564 -0.048247 -0.133246 -0.085522 -0.164132 -0.166200 0.034592 0.103430 0.164018 -0.111717 0.218922
polarizability: 3.15279962e+02 3.44386439e+00 1.77779946e+02 -1.17148972e+01 8.00854685e+00 9.76708929e+01
1716.lowfreq: -3.7450 -0.0006 -0.0004 0.0006 2.9242 10.1734 24.9975 32.5247 49.5972
frequency: 24.4053 32.4959 49.5782 63.9268 80.1734 108.9544 129.5054 140.3847 170.8698 191.6764 199.7056 237.1511 265.7161 296.0629 298.6667 353.8663 365.4965 376.7680 397.4064 410.5324 454.8074 495.4647 540.8330 563.4616 575.3482 629.1783 637.6783 644.7908 655.5667 661.1845 704.9719 733.7727 772.6583 786.0775 822.5780 826.3875 838.0567 841.4776 854.6134 894.4627 922.5232 924.4044 952.3896 956.2149 974.6739 1007.8709 1014.2488 1025.2836 1065.5624 1111.6113 1116.0182 1117.9397 1154.0640 1154.4559 1159.5590 1187.8646 1201.2763 1219.3691 1240.6806 1271.9941 1285.8130 1312.9413 1315.0218 1318.1097 1326.5757 1330.4631 1372.1278 1375.5537 1385.3032 1397.2458 1421.7290 1436.8727 1450.2869 1451.0044 1456.6316 1461.4362 1467.9915 1512.0166 1519.3069 1567.3988 1585.3512 1623.7550 2958.9487 2995.0669 3007.4374 3057.9407 3080.3027 3111.6966 3130.0334 3132.3884 3150.6283 3157.3038 3170.6816 3182.1909 3243.7806 3541.6716
redmass: 5.5215 5.4276 4.2401 5.0448 4.2302 4.0181 1.9503 1.6828 2.8739 4.5331 4.5635 5.8438 5.3065 5.5146 4.0635 1.3627 4.1888 2.3626 4.3419 2.7989 3.2690 9.6731 3.0729 4.0888 3.8095 5.6888 5.0341 5.8501 6.4198 7.7085 7.1254 3.5914 4.1781 5.2011 1.6631 1.6297 4.8844 1.6022 2.0935 8.3321 1.4387 1.8186 8.6520 1.4282 1.3672 3.7398 3.0334 1.7524 4.4920 1.2532 3.0026 1.8285 1.3791 1.8818 2.0374 1.2417 1.1349 2.2710 2.0405 4.9229 3.2259 1.5058 5.8913 2.8985 1.3465 1.2910 6.1499 1.3065 4.9665 1.4681 2.7635 1.8093 2.9741 1.0512 1.1184 1.0531 1.0894 3.1930 5.6756 9.9734 7.2148 6.2475 1.0684 1.0604 1.0290 1.1011 1.0972 1.1046 1.0903 1.0889 1.1053 1.0959 1.0924 1.0950 1.0980 1.0658
irintensity: 0.9771 0.3190 1.8330 1.8796 1.6421 4.1362 4.0774 2.2445 2.7818 6.0480 0.4369 0.1647 0.6959 3.3390 5.3422 134.0652 7.2997 51.3317 4.4350 18.1917 4.4086 0.2529 23.8149 2.4170 6.5050 16.2670 16.8664 16.1624 1.1731 0.8180 1.3859 1.5288 6.0543 12.4976 21.8378 29.3685 6.4501 7.0326 12.4178 4.3861 11.2265 29.1156 77.1120 1.5350 2.0979 53.7934 13.2578 26.5365 73.0901 0.1009 29.2388 5.5425 12.5358 1.9982 75.2534 5.0158 1.8816 1.3978 14.0125 131.9404 234.2833 14.1091 109.5216 77.2970 27.0940 7.4495 21.5168 12.1239 26.7003 58.8954 9.2156 61.3665 25.5425 14.2126 13.5084 43.0102 2.8034 276.6322 27.1878 340.0708 6.4975 6.0340 55.1215 35.2292 53.4712 20.8400 54.6330 24.9575 9.8271 18.0093 19.8152 6.4656 12.1288 3.7684 0.2261 1.9899
temp: 298.150 k
press: 1.00000 atm
elementType: 8 8 7 7 7 7 6 6 6 6 6 6 6 6 6 6 6 6 6 6 1 1 1 1 1 1 1 1 1 1 1 1 1 1
symmnumber: 1
zpe: 689035.4 jmol-1
zpe.correction: 0.262440 hartree
zpe.thermalcorrener: 0.279934 hartree
zpe.thermalcorrenthalpy: 0.280878 hartree
zpe.thermalcorrgfe: 0.215368 hartree
zpe.sumelectzpe: -909.893225 hartree
zpe.sumelectthermal: -909.875731 hartree
zpe.sumelectthermalent: -909.874787 hartree
zpe.sumelectthermalfe: -909.940296 hartree
dipole: 0.5769 -1.3206 -1.3647
dipole: 1.9847
quadrupole: -111.2682 -114.7081 -120.8137
quadrupole: 4.7154 -12.7156 2.1482
quadrupole: 4.3284 0.8886 -5.2170 4.7154 -12.7156 2.1482
hfenergy: -910.1556647 hartree
pointgroup: C01 [X(C14H14N4O2)]
dipole: -0.2309414 0.4675425 -0.5812122 debye
polarizability: 315.3593494|4.7914971|175.666456|10.3628171|-15.186122|99.7049955 unknown
InChI: InChI=1S/C14H14N4O2/c1-20-14-12-13(15-8-16-14)18(9-17-12)11-4-2-10(3-5-11)6-7-19/h2-5,8-9,19H,6-7H2,1H3
charge 0 multiplicity 1
34 atoms
O  5.076237 -0.498281 0.301944
O  -5.680084 0.173334 1.822367
N  0.431961 -0.718203 -0.139606
N  2.375778 -1.946378 0.085303
N  1.429268 1.57266 -0.151687
N  3.864235 1.526145 0.095345
C  -0.977128 -0.461566 -0.26277
C  -3.776836 -0.001938 -0.55647
C  1.487638 0.210861 -0.085116
C  -5.268687 0.265486 -0.657025
C  -1.440115 0.739252 -0.855917
C  -1.908669 -1.422941 0.199962
C  2.676378 -0.5727 0.064217
C  -2.825382 0.956943 -0.99153
C  -3.291469 -1.193546 0.044302
C  1.042218 -1.989879 -0.037944
C  -5.821939 0.981528 0.607021
C  3.889039 0.166295 0.155017
C  2.65525 2.155216 -0.052949
C  6.304022 0.329197 0.389526
H  -5.820853 -0.684287 -0.780911
H  -5.491129 0.898897 -1.537477
H  -0.719628 1.492262 -1.183052
H  -1.566803 -2.337518 0.695458
H  -3.172766 1.888236 -1.454858
H  -4.004268 -1.953974 0.383207
H  0.463954 -2.908274 -0.096123
H  -6.908082 1.139302 0.50295
H  -5.329034 1.970151 0.726459
H  2.68313 3.247422 -0.097317
H  -4.714708 0.025942 1.996525
H  6.249844 1.006534 1.257705
H  6.430303 0.927281 -0.527981
H  7.112325 -0.40646 0.503729
