program: Gaussian 09
title: 000258591
version: EM64L-G09RevD.01
frameworkgroup: C1[X(C10H11N5O2)]
method: RPBEPBE
basis: SDD
operation: Freq
keyword: #p
keyword: freq=noraman
keyword: PBEPBE/SDD
title: #p freq=noraman PBEPBE/SDD
converged: YES YES NO NO
title: Mulliken charges:
elementType: O O N N N N N C C C C C C C C C C H H H H H H H H H H H
charge: -0.280747 -0.259303 -0.167647 -0.089478 -0.052411 -0.064279 -0.610742 -0.177875 -0.117742 -0.073937 -0.043213 -0.682144 0.154657 -0.181797 -0.096265 0.165086 -0.363718 0.269591 0.256158 0.266413 0.250589 0.221997 0.212692 0.250974 0.294863 0.242222 0.344233 0.331824
chargesum: 0.00000
title: Mulliken charges with hydrogens summed into heavy atoms:
elementType: O O N N N N N C C C C C C C C C C
charge: -0.280747 -0.259303 -0.167647 -0.089478 -0.052411 -0.064279 0.065316 0.091716 0.138416 0.192476 0.207375 0.003518 0.154657 0.113066 -0.096265 0.165086 -0.121496
polarizability: 2.11725915e+02 -1.45566687e+00 1.38019992e+02 -1.17913416e+00 1.10092398e+01 8.74051665e+01
1716.lowfreq: -0.0006 -0.0003 0.0007 3.0051 8.3832 13.0554 37.0474 53.5625 67.8821
frequency: 36.1261 53.4960 67.8190 126.6133 144.6639 171.5718 206.2596 213.3986 240.0100 271.0593 275.3694 329.0364 353.1262 433.6867 458.5101 509.3172 512.6894 547.1030 548.2788 564.1559 620.5587 646.9169 661.3167 668.2110 695.2198 738.3266 768.1881 790.3384 797.0915 804.7255 820.5323 846.6380 852.1575 877.6619 908.4689 927.9429 952.5658 961.4815 1014.2455 1029.3149 1044.2655 1045.4862 1104.0167 1107.0072 1129.1453 1186.9585 1187.6643 1221.8788 1259.2150 1263.4294 1281.4336 1290.7149 1308.9013 1316.1513 1317.5383 1360.5760 1368.9650 1384.6713 1389.8003 1396.7479 1431.7548 1463.0883 1464.0069 1475.6055 1545.3103 1579.0305 1633.1182 2987.0192 3002.2398 3034.4245 3082.5986 3105.5654 3146.4762 3165.8611 3166.2661 3258.0784 3540.9208 3696.2922
redmass: 5.4367 4.4667 4.9280 5.1611 5.9042 5.8781 3.2869 1.3099 3.1878 4.7492 3.6040 7.3142 3.9750 5.4905 4.3906 8.4560 1.2357 1.7389 1.6483 4.0574 8.6259 4.8817 5.3381 7.7402 6.2036 5.0937 5.9428 6.0280 7.2417 4.0667 2.8255 1.5735 6.2467 2.7619 3.0636 1.4286 1.8788 2.2894 2.3078 1.3902 2.6370 2.3189 2.0520 1.7182 4.5601 1.9572 1.3267 2.2173 1.2327 2.0717 2.1736 1.8135 3.8349 1.5618 6.0198 2.2370 3.0445 3.2226 1.2733 1.6468 3.1341 1.0576 4.1520 1.0481 8.1421 1.8619 2.7798 1.0368 1.0844 1.0868 1.0992 1.0995 1.0893 1.0921 1.0988 1.0994 1.0442 1.1056
irintensity: 0.2819 3.7460 6.6008 6.2365 2.2514 0.5435 0.2872 1.8511 0.2836 6.6584 7.2293 2.9346 6.5764 7.2332 8.3550 4.8265 270.7087 2.1571 3.2425 0.2477 3.4466 42.3078 8.4146 1.2264 11.2285 23.1405 19.8213 19.2065 19.9590 18.4736 21.4449 7.9985 3.8828 2.2963 108.4225 11.4524 54.0627 0.7869 39.9024 3.9879 112.0700 6.8097 11.4962 9.9963 8.8807 54.1599 4.8906 77.2944 2.2154 41.9688 74.3446 33.7745 24.7939 9.1123 11.8603 75.4789 3.3246 11.6279 24.0528 8.9039 103.7697 10.2467 39.6370 12.6282 70.4369 35.9451 610.8958 17.7394 8.2938 13.5561 36.7282 16.8445 9.1776 17.3599 13.8188 6.3038 123.4064 49.4832
temp: 298.150 k
press: 1.00000 atm
elementType: 8 8 7 7 7 7 7 6 6 6 6 6 6 6 6 6 6 1 1 1 1 1 1 1 1 1 1 1
symmnumber: 1
zpe: 557378.5 jmol-1
zpe.correction: 0.212294 hartree
zpe.thermalcorrener: 0.226271 hartree
zpe.thermalcorrenthalpy: 0.227215 hartree
zpe.thermalcorrgfe: 0.170896 hartree
zpe.sumelectzpe: -810.593603 hartree
zpe.sumelectthermal: -810.579627 hartree
zpe.sumelectthermalent: -810.578683 hartree
zpe.sumelectthermalfe: -810.635002 hartree
dipole: 3.5039 0.1453 1.0141
dipole: 3.6506
quadrupole: -71.7441 -104.6964 -98.6944
quadrupole: 11.8468 3.9145 2.8630
quadrupole: 19.9675 -12.9848 -6.9827 11.8468 3.9145 2.8630
hfenergy: -810.8058976 hartree
pointgroup: C01 [X(C10H11N5O2)]
dipole: 1.373909 0.2492318 0.3363009 debye
polarizability: 211.763467|-0.6806582|136.7126566|0.2058261|-13.5664136|88.6749491 unknown
InChI: InChI=1S/C10H11N5O2/c1-4-6-7(17-6)10(16-4)15-3-14-5-8(11)12-2-13-9(5)15/h2-4,6-7,10H,11H2,1H3
charge 0 multiplicity 1
28 atoms
O  2.743034 -1.005483 1.545071
O  2.188409 -0.129875 -1.078136
N  0.127533 -0.177906 0.13234
N  -1.428974 -1.844527 0.380631
N  -1.388504 1.723308 -0.391708
N  -3.75119 1.035619 -0.406817
N  -4.449158 -1.180073 0.033653
C  2.297545 0.4127 1.254778
C  3.652474 -0.03646 0.816105
C  1.408553 0.501791 0.016468
C  3.631675 -0.215034 -0.698662
C  4.453566 0.860112 -1.426049
C  -1.121129 0.420512 -0.094293
C  -0.120542 -1.53873 0.405649
C  -2.066338 -0.624287 0.07137
C  -3.436243 -0.268969 -0.099162
C  -2.732188 1.939781 -0.533927
H  2.096565 1.038043 2.128527
H  4.578979 0.220323 1.338289
H  1.176888 1.557567 -0.227999
H  3.95433 -1.229966 -0.993827
H  4.153295 1.876615 -1.114028
H  5.533364 0.732805 -1.222133
H  4.293028 0.774571 -2.513361
H  0.692927 -2.230811 0.603621
H  -3.033332 2.962788 -0.778094
H  -4.232307 -2.149021 0.256995
H  -5.410159 -0.873194 -0.100699
