program: Gaussian 09
title: 000258588
version: EM64L-G09RevD.01
frameworkgroup: C1[X(C10H10N2O2)]
method: RPBEPBE
basis: SDD
operation: Freq
keyword: #p
keyword: freq=noraman
keyword: PBEPBE/SDD
title: #p freq=noraman PBEPBE/SDD
converged: YES YES NO NO
title: Mulliken charges:
elementType: O O N N C C C C C C C C C C H H H H H H H H H H
charge: -0.199294 -0.196300 0.003469 -0.001013 0.182517 0.393953 0.272101 0.500424 -0.555301 -0.588162 -0.628464 -0.784996 -0.804433 -0.130434 0.243676 0.288448 0.273759 0.266099 0.262349 0.257354 0.233936 0.240426 0.235858 0.234026
chargesum: 0.00000
title: Mulliken charges with hydrogens summed into heavy atoms:
elementType: O O N N C C C C C C C C C C
charge: -0.199294 -0.196300 0.003469 -0.001013 0.182517 0.393953 0.272101 0.500424 -0.311624 -0.299713 -0.088606 -0.031357 -0.094122 -0.130434
polarizability: 1.52705846e+02 7.21924590e-01 1.50611778e+02 5.96371104e+00 2.85974436e+00 8.14140618e+01
1716.lowfreq: -6.6660 -5.2580 -0.0007 -0.0006 0.0004 6.6671 40.0319 42.2517 48.9800
frequency: 40.0126 42.1593 48.9639 67.7365 114.5321 143.4704 161.3561 209.2495 223.2259 263.0920 323.3718 344.9072 357.6705 372.8777 392.8297 427.7915 457.9341 485.6497 543.9602 575.9077 634.9463 701.4177 718.6845 739.9646 748.0601 864.0089 894.9813 910.8439 924.1462 945.2681 969.5571 1014.3592 1032.9017 1035.4371 1053.6341 1123.5226 1186.6453 1208.0268 1216.8860 1245.8115 1270.2552 1302.6293 1360.1785 1370.2395 1402.4846 1407.7317 1412.0284 1445.2051 1456.5205 1471.7325 1475.4202 1484.4443 1490.8325 1576.5181 1625.0998 2197.9705 2983.9336 3001.8897 3004.6795 3057.3396 3062.9079 3084.6263 3096.1104 3113.0917 3121.6315 3172.4007
redmass: 3.0280 1.5381 3.7537 5.3595 3.9970 1.2288 3.7406 4.8330 4.5261 3.1338 3.7626 4.4462 5.6923 2.5759 5.1397 5.7288 4.8349 4.4117 3.3462 4.1165 5.0083 8.0038 7.1304 3.6054 4.6033 3.3704 1.7758 2.9821 1.6826 1.7806 3.2019 1.5578 1.6896 1.5513 1.5665 2.7077 1.1401 6.2768 2.4718 1.7875 2.4991 1.6543 5.5914 5.3246 1.2473 1.3140 2.7775 1.0979 1.1401 1.0454 1.1484 1.1853 2.5334 5.8125 6.8153 12.4185 1.0378 1.0398 1.0594 1.1004 1.0977 1.0942 1.0988 1.0998 1.0920 1.0923
irintensity: 4.4588 1.1471 0.4146 3.1867 2.2879 1.5820 0.1388 2.3848 2.0996 3.4639 0.8659 0.6752 0.5516 1.1814 1.2730 0.4211 1.3964 2.2269 8.7675 1.6625 8.9566 11.1284 11.7448 5.3359 1.3293 14.5885 17.0826 0.8195 4.8187 1.0164 1.4341 2.2034 6.5571 3.3230 14.6251 1.1541 4.1652 201.4339 1.5496 41.6815 7.6767 2.2009 79.4830 60.8289 10.3608 17.6300 4.7588 41.6030 3.5680 15.1997 13.8845 4.9913 50.8044 3.4314 8.6290 7.6669 23.1523 6.3545 6.5678 1.6645 15.0897 6.2369 12.9547 16.1538 11.8182 1.9537
temp: 298.150 k
press: 1.00000 atm
elementType: 8 8 7 7 6 6 6 6 6 6 6 6 6 6 1 1 1 1 1 1 1 1 1 1
symmnumber: 1
zpe: 473803.2 jmol-1
zpe.correction: 0.180462 hartree
zpe.thermalcorrener: 0.194245 hartree
zpe.thermalcorrenthalpy: 0.195189 hartree
zpe.thermalcorrgfe: 0.138498 hartree
zpe.sumelectzpe: -645.910724 hartree
zpe.sumelectthermal: -645.896941 hartree
zpe.sumelectthermalent: -645.895997 hartree
zpe.sumelectthermalfe: -645.952687 hartree
dipole: -1.6689 4.3367 -3.4244
dipole: 5.7723
quadrupole: -102.4452 -75.4417 -85.3605
quadrupole: 3.2460 10.6259 2.0764
quadrupole: -14.6961 12.3074 2.3886 3.2460 10.6259 2.0764
hfenergy: -646.0911857 hartree
pointgroup: C01 [X(C10H10N2O2)]
dipole: -0.7260671 1.689184 -1.3329766 debye
dipolederiv: -0.7893399 0.0026613 -0.2698774 0.0170247 -0.4099562 -0.117576 -0.2525389 -0.1260462 -0.4149595 -0.4680514 0.1560526 -0.0368083 0.1494677 -0.7252014 -0.2309508 -0.0948328 -0.1901001 -0.367798 1.3279368 -0.3904544 0.3953728 -0.4480439 0.9983021 0.3577665 0.4083121 0.3029326 0.5665062 -0.2735631 -0.0101553 -0.0061079 -0.032018 -0.2265808 -0.0077544 0.1068479 0.0252472 -0.1977434 0.0044742 -0.1694474 -0.0003618 0.1536103 0.2750892 0.0544855 0.084173 -0.0493012 -0.0009956 0.3427457 0.2110191 0.0386348 0.0668584 -0.2094907 -0.0014226 0.0617089 0.0398726 -0.09497 -0.3266329 0.2223723 -0.0912056 0.3490438 -0.1239083 0.0016347 -0.0621338 0.0142533 0.01539 -0.2637234 0.0219112 -0.0476416 0.0811696 0.4846072 0.0553243 -0.0609334 0.0717919 -0.0138621 0.0447855 -0.1322509 0.0583447 -0.0121571 -0.0382125 0.0082513 0.0385853 -0.0166074 -0.1321208 0.0096334 0.0764657 0.0536128 -0.3001134 -0.1422608 -0.0583259 -0.0456611 0.0596092 -0.1221198 0.1371612 -0.0547656 0.0481896 -0.072124 0.1460243 0.0491182 0.0438011 0.0484979 0.1014936 0.1225042 0.036834 -0.0208711 -0.0475407 -0.2116011 -0.0360989 -0.0419575 -0.0630813 0.0296027 0.0570359 0.0618331 0.0109346 -0.0092247 -0.1683016 -0.0240532 0.0101346 -0.0292039 0.0547463 -0.0528592 0.0042647 -0.0944066 0.0358623 -0.0138282 -0.0658417 -0.1980145 -0.0815774 0.0514179 -0.0186044 0.1012551 -0.0341192 0.0905919 0.0310682 0.0072928 -0.0261286 0.0132867 0.126276 0.0444222 -0.0493555 -0.024253 -0.0329727 0.1007105 -0.0035575 -0.0173444 -0.0387328 0.1523863 0.0478032 -0.0226479 0.0434282 -0.0615317 0.0195122 -0.0868469 0.0270407 -0.0360912 0.0338543 0.031494 0.0195095 -0.0000355 0.0821162 -0.0004456 0.0859222 0.0265427 0.0299931 0.0809269 0.0869895 0.0046538 0.0511853 -0.0171196 0.0405126 -0.0361003 0.0357107 -0.0564104 -0.0298088 0.0288143 0.0476067 -0.0742912 0.0177668 0.0567069 0.0352028 -0.059831 0.0613019 0.0174238 -0.1158052 -0.0920358 0.0117757 -0.033424 0.0689044 0.0038456 0.0254286 0.0165029 0.092859 0.0369615 0.0357386 0.1077478 0.0112067 0.00422 -0.0444066 0.0802818 -0.0948409 -0.0086944 -0.1035172 -0.0987401 -0.0441275 0.0110738 0.062712 0.0012833 -0.0416818 -0.0194287 0.1047706 0.0893351 0.0176753 -0.0751196 0.0004776 -0.0185826 0.0528079 -0.0475096 0.1181322 -0.0445813 unknown
polarizability: 152.2215046|0.593524|150.5442479|7.7876786|4.7112216|81.9659336 unknown
InChI: InChI=1S/C10H10N2O2/c1-7-5-9(3-4-11)8(2)10(6-7)12(13)14/h5-6H,3H2,1-2H3
charge 0 multiplicity 1
24 atoms
O  3.410639 -0.554005 0.892034
O  2.500754 -2.144724 -0.458364
N  2.450651 -1.008913 0.156019
N  -3.869723 -1.23093 1.197879
C  -0.023843 -0.725373 -0.328438
C  -1.088521 0.210651 -0.510026
C  1.242994 -0.157093 -0.011966
C  0.39385 2.136977 -0.021823
C  -0.872447 1.599051 -0.365228
C  1.455875 1.230686 0.155567
C  -2.500644 -0.261046 -0.88088
C  -0.267023 -2.21924 -0.443141
C  0.590428 3.631527 0.144746
C  -3.257677 -0.803289 0.267327
H  -1.716179 2.284696 -0.514938
H  2.458049 1.576885 0.422942
H  -2.469218 -1.034327 -1.670629
H  -3.075799 0.587557 -1.294105
H  0.055791 -2.599266 -1.429359
H  0.315992 -2.785159 0.300806
H  -1.329952 -2.466131 -0.296875
H  -0.022741 4.022568 0.978027
H  1.643265 3.879303 0.358238
H  0.290674 4.181095 -0.766612
