program: Gaussian 09
title: 000258601
version: EM64L-G09RevD.01
frameworkgroup: C1[X(C19H16ClN5O)]
method: RPBEPBE
basis: SDD
operation: Freq
keyword: #p
keyword: freq=noraman
keyword: PBEPBE/SDD
title: #p freq=noraman PBEPBE/SDD
converged: YES YES NO NO
title: Mulliken charges:
elementType: Cl O N N N N N C C C C C C C C C C C C C C C C C C C H H H H H H H H H H H H H H H H
charge: -0.063344 -0.441742 -0.257487 -0.075297 -0.438514 -0.044574 -0.089979 0.444362 0.123253 -0.145829 0.465239 -0.365092 -0.351568 -0.554044 -0.239610 -0.407375 -0.430556 0.181896 -0.318283 0.479656 -0.366788 -0.448239 -0.319100 -0.184479 -0.206087 -0.119783 0.234861 0.304300 0.229504 0.206947 0.269454 0.238885 0.264630 0.341587 0.225550 0.195120 0.249057 0.232184 0.322766 0.254861 0.253615 0.350044
chargesum: 0.00000
title: Mulliken charges with hydrogens summed into heavy atoms:
elementType: Cl O N N N N N C C C C C C C C C C C C C C C C C C C
charge: -0.063344 -0.091698 -0.257487 -0.075297 -0.096928 -0.044574 -0.089979 0.444362 0.123253 -0.145829 0.465239 -0.130230 -0.047268 -0.117592 0.029844 -0.168490 -0.165927 0.181896 0.102386 0.479656 -0.117731 -0.216055 0.003667 0.070382 0.047529 -0.119783
polarizability: 5.37908188e+02 -5.01324833e+00 2.34512699e+02 1.40938147e+01 7.87722903e+00 1.14445555e+02
1716.lowfreq: -7.4923 -1.4631 -0.0003 0.0011 0.0016 4.7293 14.6710 18.3755 38.2665
frequency: 14.6236 18.2737 38.2604 42.2175 50.4272 55.6091 70.3602 91.6408 121.3699 134.6939 147.9876 175.1892 202.7021 219.4034 246.9798 271.9043 289.3165 309.6220 324.6584 336.9781 356.0281 376.0547 386.3178 410.9690 413.3260 419.0062 461.4093 505.8225 517.2104 528.4659 561.2092 583.8682 609.0761 625.8713 634.1157 636.5007 650.8824 662.4651 678.7443 705.1849 716.5672 731.8444 765.7810 775.9669 788.9789 809.4300 815.4293 817.0794 827.4540 840.5074 846.4694 858.8714 864.8467 926.4039 927.7359 939.6895 941.4334 953.8095 978.5781 988.7711 993.7469 1008.5032 1012.5860 1026.1323 1048.6111 1073.2203 1106.5134 1116.9042 1124.6114 1153.4622 1162.3041 1184.1962 1185.6807 1201.4255 1218.3662 1237.8074 1246.2583 1269.5750 1296.3561 1303.7957 1309.6717 1311.8064 1325.1694 1329.3952 1356.3675 1364.0225 1374.1388 1379.1653 1389.7872 1402.9783 1421.5667 1435.6674 1451.7837 1456.8432 1466.4975 1478.7726 1506.7933 1513.8503 1537.5337 1582.3137 1585.3620 1607.2710 1616.0535 1624.0434 2955.3160 2995.0774 3058.8673 3080.4025 3123.3988 3126.8135 3136.2902 3155.5435 3163.8555 3166.3859 3171.7150 3177.3051 3187.4854 3248.2451 3492.5720 3539.1483
redmass: 7.6226 5.8277 6.3113 5.7369 5.2862 4.3975 7.4984 4.4412 7.2775 3.4092 8.4165 5.3055 6.4660 7.1075 5.6361 5.1128 6.1576 5.1301 4.7990 5.4534 1.4023 3.6080 2.7363 2.6827 3.0376 5.9922 3.5425 2.7879 7.7022 3.6564 3.7445 3.1964 6.0805 7.1218 5.6544 5.7962 3.8401 6.6066 6.8788 3.3877 1.4426 3.6326 6.3796 5.0446 3.5322 5.9330 2.0020 1.4000 1.5422 1.6471 1.3945 1.7532 7.6066 1.4397 1.9110 1.3613 7.6897 1.3825 1.3696 1.3087 4.3705 3.5806 3.1678 1.7975 4.0652 2.5219 1.9245 1.6641 2.4487 1.3645 2.1778 1.1143 1.2357 1.1503 2.2468 2.5602 2.3494 3.0572 1.3667 4.5864 2.2703 2.3020 1.3322 1.3075 4.0819 2.9230 1.3616 3.5553 2.4645 4.1976 2.8808 3.8925 2.8648 1.1117 1.0882 2.2391 3.9691 3.1053 6.1661 8.7306 7.2214 5.9587 3.3984 5.5728 1.0686 1.0607 1.1008 1.0968 1.0902 1.0886 1.0906 1.0957 1.0908 1.0921 1.0952 1.0954 1.0962 1.0979 1.0759 1.0658
irintensity: 0.0923 0.4922 0.0441 0.2004 0.2374 3.4344 1.2839 0.2290 1.8918 4.7045 0.6883 0.6790 0.1245 0.8559 2.0007 1.3439 0.3606 3.3708 6.3108 0.1790 137.3244 40.6407 20.6168 18.0673 0.2250 41.7172 3.8768 33.1531 9.1469 8.3640 10.2800 14.1488 28.7078 0.9830 6.5493 1.1201 10.7770 3.6125 4.3718 5.9522 37.8777 0.7953 18.6148 1.9618 23.4943 31.5696 5.5313 54.0937 42.0528 2.3027 56.9525 10.0277 6.9459 10.2274 30.0732 1.3533 46.1587 1.6964 10.0966 2.8090 38.1067 46.2970 13.6086 32.9976 11.0752 40.7563 12.4607 8.8005 11.2605 22.5587 77.0487 1.7218 7.9722 6.6233 6.0854 36.4431 28.0539 23.8133 15.6855 84.6732 74.0474 81.2901 12.1795 13.6607 34.5115 108.1693 49.2816 20.0683 6.2006 23.8177 11.3250 189.7373 13.3953 13.1380 1.5950 363.5585 272.7634 145.5726 149.6230 372.5274 4.6156 80.6228 663.5903 40.8283 61.0844 37.3526 20.5085 58.0257 12.2135 17.8368 11.6677 8.7024 2.5723 13.5627 2.8908 9.4157 19.0237 0.7114 35.4935 2.1122
temp: 298.150 k
press: 1.00000 atm
elementType: 17 8 7 7 7 7 7 6 6 6 6 6 6 6 6 6 6 6 6 6 6 6 6 6 6 6 1 1 1 1 1 1 1 1 1 1 1 1 1 1 1 1
symmnumber: 1
zpe: 834848.2 jmol-1
zpe.correction: 0.317977 hartree
zpe.thermalcorrener: 0.339934 hartree
zpe.thermalcorrenthalpy: 0.340878 hartree
zpe.thermalcorrgfe: 0.263498 hartree
zpe.sumelectzpe: -1540.859374 hartree
zpe.sumelectthermal: -1540.837417 hartree
zpe.sumelectthermalent: -1540.836472 hartree
zpe.sumelectthermalfe: -1540.913853 hartree
dipole: -3.9369 3.4925 -0.9345
dipole: 5.3451
quadrupole: -174.4404 -147.6523 -166.6411
quadrupole: -9.5339 13.3021 2.8022
quadrupole: -11.5292 15.2590 -3.7298 -9.5339 13.3021 2.8022
hfenergy: -1541.1773506 hartree
pointgroup: C01 [X(C19H16Cl1N5O1)]
dipole: -1.5420717 1.3684629 -0.4142378 debye
polarizability: 537.775654|-5.8281039|234.9247767|15.5391168|4.1111597|114.1660124 unknown
InChI: InChI=1S/C19H16ClN5O/c20-14-3-5-15(6-4-14)24-18-17-19(22-11-21-18)25(12-23-17)16-7-1-13(2-8-16)9-10-26/h1-8,11-12,24,26H,9-10H2
charge 0 multiplicity 1
42 atoms
Cl 8.988305 -0.594434 0.259072
O  -7.446076 -1.126812 1.850028
N  -1.571363 0.718086 -0.131994
N  0.344007 1.966075 0.168602
N  3.076264 0.714447 0.117923
N  -0.490582 -1.535888 -0.39981
N  1.964962 -1.402143 -0.258871
C  -2.974569 0.432876 -0.266652
C  -0.487316 -0.1834 -0.20171
C  0.672123 0.614262 -0.023052
C  -5.766206 -0.106932 -0.497872
C  -3.873731 1.467547 -0.628089
C  -3.462233 -0.877798 -0.045832
C  -7.258837 -0.383511 -0.545759
C  -0.997089 1.987712 0.098225
C  -5.251968 1.195461 -0.729697
C  -4.844238 -1.134123 -0.164664
C  1.938181 -0.044626 -0.056444
C  -7.93381 -0.182891 0.840245
C  4.445315 0.345724 0.138886
C  0.770835 -2.055761 -0.416349
C  5.392538 1.387321 0.344218
C  4.90074 -0.990062 -0.03159
C  6.772595 1.10802 0.381147
C  6.283145 -1.268824 0.005684
C  7.201961 -0.222776 0.210982
H  -3.5063 2.473383 -0.856006
H  -2.760266 -1.68267 0.184947
H  -7.446495 -1.423684 -0.86961
H  -7.756487 0.287661 -1.272265
H  -1.603818 2.877817 0.238646
H  -5.936328 2.004169 -1.01255
H  -5.210707 -2.15677 -0.018541
H  2.875088 1.71065 0.258023
H  -9.013863 -0.39054 0.764561
H  -7.796335 0.867393 1.176437
H  0.842353 -3.135742 -0.573958
H  5.052837 2.422149 0.476366
H  4.169547 -1.784448 -0.18929
H  7.497554 1.911402 0.539211
H  6.636389 -2.295837 -0.124666
H  -6.472125 -0.986586 1.976167
