program: Gaussian 09
title: 000258629
version: EM64L-G09RevD.01
frameworkgroup: C1[X(C19H18ClN2O3P)]
method: RPBEPBE
basis: SDD
operation: Freq
keyword: #p
keyword: freq=noraman
keyword: PBEPBE/SDD
title: #p freq=noraman PBEPBE/SDD
converged: YES YES NO NO
title: Mulliken charges:
elementType: Cl P O O O N N C C C C C C C C C C C C C C C C C C C H H H H H H H H H H H H H H H H H H
charge: -0.045957 1.324538 -0.533816 -0.533922 -0.596650 -0.757789 -0.064852 0.232574 0.232673 0.319801 0.319800 -0.333844 -0.333871 0.226209 -0.380963 -0.380984 -0.794282 -0.794244 -0.228034 -0.228037 -0.236870 -0.236873 -0.244630 -0.135324 -0.352937 -0.053215 0.373018 0.294818 0.294817 0.235423 0.235423 0.221611 0.246122 0.242110 0.221609 0.246119 0.242072 0.232991 0.232988 0.230027 0.230023 0.294555 0.269632 0.268137
chargesum: 0.00000
title: Mulliken charges with hydrogens summed into heavy atoms:
elementType: Cl P O O O N N C C C C C C C C C C C C C C C C C C C
charge: -0.045957 1.324538 -0.533816 -0.533922 -0.596650 -0.384771 -0.064852 0.232574 0.232673 0.319801 0.319800 -0.039026 -0.039053 0.226209 -0.145540 -0.145560 -0.084438 -0.084444 0.004957 0.004951 -0.006843 -0.006849 0.049925 0.134307 -0.084800 -0.053215
polarizability: 2.95851828e+02 2.36325528e-02 2.83065660e+02 3.54143810e-02 4.67191618e+01 2.09165080e+02
1716.lowfreq: -1.1544 -0.0024 -0.0016 -0.0015 2.4330 6.8325 11.8760 17.8122 24.9469
frequency: 11.7013 17.7286 24.8185 26.9145 43.1532 51.4970 71.6756 90.4896 100.9619 115.5735 118.2792 136.3625 147.5233 167.4964 173.2190 201.8144 204.9486 209.3719 224.4934 257.1064 267.6579 278.0512 308.8245 320.6243 360.9428 370.9831 417.3671 421.9533 438.6223 441.6400 457.9444 476.0000 487.0751 497.5387 498.1939 535.0551 536.0174 569.5712 585.7055 607.8837 608.0406 645.5583 659.8059 675.2312 715.0294 715.0647 748.8572 763.2459 763.8052 769.0171 776.7441 785.9237 828.7502 844.7593 851.4182 870.1891 870.7711 909.5437 911.7912 948.8824 949.4395 959.8389 971.3379 985.5407 985.7271 986.5528 986.9553 1035.0144 1047.3598 1050.2348 1050.4113 1053.1863 1091.3188 1093.9573 1102.7250 1136.9390 1154.8541 1165.1405 1177.7595 1179.9041 1230.3003 1232.5725 1237.8192 1288.2113 1289.6354 1296.0130 1332.2503 1357.4516 1376.1219 1376.4410 1398.3294 1401.5413 1402.4903 1427.3009 1428.7593 1456.7336 1461.6685 1462.0747 1477.0915 1478.3565 1483.4020 1486.1143 1560.0676 1579.3057 1592.6764 1593.7209 1608.2037 1610.7698 2982.8708 2983.0441 3062.7781 3062.8360 3093.1422 3093.3291 3126.9140 3126.9383 3140.8463 3140.8899 3154.8500 3154.9154 3158.4085 3162.9038 3169.3153 3169.3915 3181.2658 3513.1097
redmass: 6.5434 5.1777 4.1843 4.7900 6.4300 5.2203 3.4329 7.3120 3.1460 1.0843 1.7840 2.9107 4.5343 4.1225 4.6873 6.0352 7.3710 7.0790 4.7330 5.4033 5.6847 5.2042 6.3726 6.0412 4.5452 7.3547 3.8176 4.1294 3.1373 3.0807 6.1255 9.6158 5.1515 2.3994 6.1354 3.7446 3.7187 6.6605 7.4369 9.1105 1.3543 7.8314 8.0059 5.5316 3.2710 3.2908 4.7779 1.5292 1.2776 3.1811 5.2803 6.3983 1.6886 4.3448 5.8111 1.2973 1.3139 1.3858 4.9169 1.3612 1.3675 1.3271 5.4855 1.3256 1.3331 1.5799 1.5730 4.7888 2.1158 1.5203 1.5260 2.8271 2.5786 3.0885 2.5182 1.4336 1.8121 1.7917 1.0859 1.1859 1.9478 2.6587 2.4647 1.4220 1.4294 1.4861 6.3221 2.7223 7.4874 7.4865 1.9546 1.2488 1.2487 1.9762 1.9971 2.3551 1.0462 1.0563 1.2924 1.3053 2.0625 2.0429 6.0108 6.3541 5.9949 6.0557 7.1055 7.0117 1.0370 1.0370 1.0965 1.0965 1.1000 1.0999 1.0871 1.0871 1.0894 1.0894 1.0943 1.0943 1.0934 1.0900 1.1009 1.1009 1.0981 1.0751
irintensity: 0.0069 0.3360 0.0647 0.4463 0.0338 0.0101 2.3403 1.5634 0.8992 0.7202 0.4785 0.7054 0.0746 0.0442 0.8372 1.0142 3.9361 12.3850 8.3808 8.9598 0.8095 2.8276 0.7746 0.2329 24.3170 55.0025 2.1443 12.2766 1.0082 14.7214 17.1812 63.4690 49.8109 37.2939 10.2288 0.1295 5.8185 10.5436 2.9615 0.5189 8.9278 21.5069 18.7299 80.3080 3.7107 0.6398 2.7042 105.8424 1.9134 52.9273 244.7066 113.5631 2.2247 538.1738 12.5580 0.6662 3.6648 3.9563 154.8417 0.0257 13.6743 6.8602 20.1587 0.2321 3.3596 1.1189 2.3233 91.3712 33.0828 1.2462 17.4364 3.5014 36.7123 326.7197 10.1018 13.0879 175.8147 22.4097 20.5846 9.8496 1.8818 62.6652 3.6148 0.0766 5.1863 61.7881 30.2246 165.0993 0.3538 0.2190 1.1897 0.3456 13.7453 58.6644 5.4712 438.4381 0.3683 12.5468 4.5701 17.9447 200.9720 6.6964 11.3932 94.8198 45.2293 4.2414 20.6179 1.1426 1.3727 41.2719 4.6653 32.9478 36.2862 9.6421 1.5197 8.4045 3.8679 24.6559 14.2283 0.2904 8.1915 1.0321 41.5950 8.6394 0.5750 76.6736
temp: 298.150 k
press: 1.00000 atm
elementType: 17 15 8 8 8 7 7 6 6 6 6 6 6 6 6 6 6 6 6 6 6 6 6 6 6 6 1 1 1 1 1 1 1 1 1 1 1 1 1 1 1 1 1 1
symmnumber: 1
zpe: 864317.3 jmol-1
zpe.correction: 0.329201 hartree
zpe.thermalcorrener: 0.354372 hartree
zpe.thermalcorrenthalpy: 0.355316 hartree
zpe.thermalcorrgfe: 0.270377 hartree
zpe.sumelectzpe: -1869.427110 hartree
zpe.sumelectthermal: -1869.401939 hartree
zpe.sumelectthermalent: -1869.400995 hartree
zpe.sumelectthermalfe: -1869.485935 hartree
dipole: 0.0018 1.2009 1.4387
dipole: 1.8740
quadrupole: -145.5146 -179.8020 -161.6410
quadrupole: -0.0376 0.0031 6.8745
quadrupole: 16.8046 -17.4828 0.6782 -0.0376 0.0031 6.8745
hfenergy: -1869.7563113 hartree
pointgroup: C01 [X(C19H18Cl1N2O3P1)]
dipole: 0.000306 -0.4001167 0.6192876 debye
polarizability: 295.8517292|0.0320267|270.6885735|0.0127068|-54.2602034|221.5422651 unknown
InChI: InChI=1S/C19H18ClN2O3P/c1-14-7-3-5-9-17(14)24-26(23,22-19-12-11-16(20)13-21-19)25-18-10-6-4-8-15(18)2/h3-13,22H,1-2H3
charge 0 multiplicity 1
44 atoms
Cl 0.002049 -6.037526 0.702099
P  -0.001182 1.121986 -0.715339
O  -1.244615 1.123689 0.485334
O  1.243695 1.12429 0.483794
O  -0.002274 2.240438 -1.84234
N  -0.001114 -0.45672 -1.436954
N  -0.000663 -2.759532 -1.727098
C  -2.63607 1.280002 0.160815
C  2.634623 1.282748 0.158101
C  -3.53233 0.677902 1.081977
C  3.532461 0.682457 1.078913
C  -3.073391 2.03397 -0.948929
C  3.070009 2.036866 -0.952306
C  -0.000142 -1.729652 -0.830041
C  -4.916258 0.852701 0.835411
C  4.915941 0.859218 0.831278
C  -3.02326 -0.108512 2.272099
C  3.025368 -0.104107 2.269779
C  -4.461907 2.176541 -1.168486
C  4.458159 2.181459 -1.172891
C  -5.385387 1.586788 -0.277896
C  5.383162 1.593504 -0.282703
C  0.000984 -1.929592 0.577788
C  0.001677 -3.253851 1.057239
C  0.000018 -4.035515 -1.254829
C  0.001185 -4.313602 0.126286
H  -0.002019 -0.480765 -2.462879
H  -2.349134 2.507684 -1.619349
H  2.344573 2.509189 -1.622426
H  -5.632273 0.400503 1.531693
H  5.633136 0.408412 1.527249
H  -3.858691 -0.427994 2.917531
H  -2.319986 0.491545 2.876808
H  -2.475912 -1.012632 1.946182
H  3.861756 -0.422568 2.914475
H  2.322111 0.49545 2.875009
H  2.478571 -1.008857 1.944687
H  -4.812681 2.756286 -2.028791
H  4.807447 2.761365 -2.033691
H  -6.461812 1.701009 -0.443498
H  6.459295 1.709289 -0.449119
H  0.001303 -1.083078 1.268686
H  0.002564 -3.455395 2.13235
H  -0.000385 -4.838293 -1.998519
