program: Gaussian 09
title: 000258620
version: EM64L-G09RevD.01
frameworkgroup: C1[X(C14H16Cl2O4)]
method: RPBEPBE
basis: SDD
operation: Freq
keyword: #p
keyword: freq=noraman
keyword: PBEPBE/SDD
title: #p freq=noraman PBEPBE/SDD
converged: YES YES NO NO
title: Mulliken charges:
elementType: Cl Cl O O O O C C C C C C C C C C C C C C H H H H H H H H H H H H H H H H
charge: 0.040449 0.061078 -0.266994 -0.246349 -0.207858 -0.192768 0.012307 0.468716 -0.760684 0.272926 0.252203 -0.381178 -0.338355 -0.248076 -0.253591 -0.241387 -0.260779 -0.262286 -0.661932 -0.665734 0.358342 0.242638 0.252482 0.228017 0.229314 0.231709 0.225642 0.237927 0.237654 0.224765 0.258110 0.233282 0.216943 0.254364 0.216052 0.233051
chargesum: 0.00000
title: Mulliken charges with hydrogens summed into heavy atoms:
elementType: Cl Cl O O O O C C C C C C C C C C C C C C
charge: 0.040449 0.061078 -0.266994 -0.246349 -0.207858 -0.192768 0.012307 0.468716 -0.402342 0.272926 0.252203 -0.138540 -0.085872 -0.020058 -0.024277 -0.009678 0.202790 0.200133 0.046403 0.037733
polarizability: 1.81817965e+02 -2.02614480e+01 1.92672403e+02 -3.01212101e+00 5.36390551e+00 1.61178010e+02
1716.lowfreq: -9.1349 -4.3587 0.0003 0.0010 0.0014 9.7917 15.0544 41.0410 46.0863
frequency: 14.6694 41.0069 46.0569 53.3420 59.0759 68.2243 85.6806 93.1999 102.4490 116.8588 140.1308 154.2158 161.5007 199.7132 215.7507 226.1199 232.9865 237.1780 262.5177 293.0640 309.0741 316.8787 347.6206 358.8791 399.9543 417.2654 439.7278 498.6828 508.7445 587.6510 615.0726 650.9745 686.4949 695.5090 705.4285 712.4120 737.0759 745.8311 769.4829 792.9055 816.7709 819.6640 833.5776 843.1588 912.1830 936.0144 956.5803 973.1390 991.2082 995.7348 1006.3679 1017.5783 1032.9910 1060.7876 1096.4899 1098.3525 1104.2078 1143.3476 1151.6920 1157.8823 1159.0650 1176.8562 1179.8103 1193.3717 1213.8988 1272.0150 1277.1205 1278.0418 1335.7816 1352.9867 1353.7328 1379.6736 1394.7729 1398.7428 1436.6600 1457.3180 1459.5931 1463.2840 1466.3141 1484.0706 1484.6212 1485.6841 1592.6134 1609.8052 1624.0344 1657.2287 2996.3511 2997.1233 3030.0561 3033.0352 3091.6736 3092.8308 3097.6481 3099.2073 3123.1302 3124.7334 3128.1176 3137.3899 3150.0417 3155.3217 3160.2382 3170.7231
redmass: 5.5436 4.5535 4.3780 3.0848 3.1661 5.1520 5.0758 4.8140 5.3329 7.5812 3.9523 4.8492 7.9941 1.8753 2.3141 2.3098 2.6391 5.3495 4.9828 3.3360 2.9751 5.5816 9.2264 7.3891 2.7792 3.6775 3.4168 3.8330 6.1335 8.5953 6.4837 7.1526 5.5354 2.5260 2.6725 6.6103 3.8776 3.2653 2.3397 3.2800 1.4091 1.4620 3.4191 1.2604 1.4757 6.4673 3.0503 1.4077 5.8567 1.3286 2.6798 3.5770 2.3443 4.4404 2.1748 2.1220 2.0115 2.8129 4.8852 1.7175 1.8170 1.0680 3.6712 1.2263 1.1698 1.3205 1.1284 1.1215 1.3355 1.2667 1.2752 6.9683 1.2277 1.2259 2.2551 1.0946 1.0920 1.0446 1.0431 1.0587 1.0696 2.0012 5.9287 5.9039 10.2841 10.7250 1.0365 1.0365 1.0597 1.0598 1.0974 1.0973 1.1034 1.1035 1.1057 1.1060 1.0848 1.0884 1.0929 1.0887 1.0952 1.1003
irintensity: 1.1729 1.6414 1.6255 0.2448 0.0524 0.5506 0.3161 1.0572 0.0272 0.7900 0.4206 0.5767 0.1764 1.1651 0.8356 2.7721 1.3815 0.6204 2.6000 11.0153 1.4734 9.6102 6.6010 3.2139 0.1759 2.9591 1.2942 11.6677 12.3300 23.8464 1.2131 71.6089 2.0822 22.5075 83.4918 33.9503 7.6087 9.4435 15.8931 10.5511 6.1051 4.8625 4.7874 0.1858 1.7346 5.7607 23.3053 0.0854 1.2199 0.1092 17.7080 198.2954 8.9665 124.2721 55.0908 30.5768 48.9053 320.5295 129.7611 6.9938 6.8270 1.3867 3.7394 54.2861 10.1061 16.9443 10.1425 4.7318 1.1618 0.5931 1.4115 0.2952 25.0559 28.1533 10.2479 12.4121 13.9602 15.0755 14.7204 16.1189 14.5745 22.9069 4.3374 10.2713 91.9335 188.5439 17.2251 16.3676 26.3973 26.7656 33.0302 30.3487 1.6381 0.4379 24.8643 24.7024 0.5037 5.8156 24.5947 2.1834 23.7021 10.8956
temp: 298.150 k
press: 1.00000 atm
elementType: 17 17 8 8 8 8 6 6 6 6 6 6 6 6 6 6 6 6 6 6 1 1 1 1 1 1 1 1 1 1 1 1 1 1 1 1
symmnumber: 1
zpe: 716693.8 jmol-1
zpe.correction: 0.272974 hartree
zpe.thermalcorrener: 0.294403 hartree
zpe.thermalcorrenthalpy: 0.295347 hartree
zpe.thermalcorrgfe: 0.220296 hartree
zpe.sumelectzpe: -1762.590531 hartree
zpe.sumelectthermal: -1762.569103 hartree
zpe.sumelectthermalent: -1762.568158 hartree
zpe.sumelectthermalfe: -1762.643209 hartree
dipole: 0.0130 2.8871 0.6326
dipole: 2.9556
quadrupole: -110.8496 -127.3458 -131.7825
quadrupole: 4.4825 7.5136 1.6142
quadrupole: 12.4764 -4.0199 -8.4565 4.4825 7.5136 1.6142
hfenergy: -1762.8635053 hartree
pointgroup: C01 [X(C14H16Cl2O4)]
dipole: 0.507239 1.0307959 -0.1798663 debye
polarizability: 168.0777544|-8.265541|205.9304626|1.116334|-7.9023441|161.660161 unknown
InChI: InChI=1S/C14H16Cl2O4/c1-3-19-12(17)14(11(15)16,13(18)20-4-2)10-8-6-5-7-9-10/h5-9,11H,3-4H2,1-2H3
charge 0 multiplicity 1
36 atoms
Cl -1.182131 0.368974 2.847125
Cl 0.420381 -2.13613 2.271963
O  2.459251 -0.607376 0.331868
O  -2.234543 0.160008 -0.30806
O  1.25805 -1.119066 -1.599952
O  -1.31653 -1.977937 -0.360766
C  0.099706 -0.061662 0.337497
C  0.185469 1.44787 -0.027328
C  0.255279 -0.323816 1.858802
C  1.304244 -0.696634 -0.429086
C  -1.205073 -0.751638 -0.163426
C  0.550192 2.451412 0.901688
C  -0.027193 1.816032 -1.382002
C  0.679692 3.797388 0.489439
C  0.10404 3.157382 -1.792232
C  0.456412 4.1580 -0.856692
C  3.717233 -1.132532 -0.296098
C  -3.575282 -0.407313 -0.672017
C  3.82012 -2.646648 -0.102413
C  -4.325205 -0.864152 0.58142
H  1.160997 0.14315 2.259251
H  0.719944 2.215627 1.955827
H  -0.289702 1.049459 -2.118807
H  0.952625 4.561824 1.225231
H  -0.067271 3.421317 -2.841561
H  0.556549 5.201892 -1.173766
H  4.511598 -0.584438 0.234419
H  3.708189 -0.85614 -1.364949
H  -3.419343 -1.241097 -1.379054
H  -4.07609 0.435226 -1.174482
H  3.013004 -3.167498 -0.643353
H  3.760881 -2.912347 0.966598
H  4.789097 -3.003519 -0.49792
H  -3.80428 -1.70449 1.069254
H  -5.339418 -1.20263 0.298821
H  -4.423193 -0.037391 1.304862
